{"text_format":"1","workbook":"xlsx","n_sheets":25,"sheets":["Start","Stand","Wedstr. 1","wedstr. 2","wedstr. 3","wedstr. 4","wedstr. 5","wedstr. 6","wedstr. 7","wedstr. 8","wedstr. 9","wedstr. 10","wedstr. 11","wedstr. 12","wedstr. 13","wedstr. 14","wedstr. 15","Baanbezetting","1e klasse","2e klasse","3e klasse","4e klasse","5e klasse","6e klasse","7e klasse"],"not_rendered":{"charts":0,"images":0,"macros":1,"external_links":0,"defined_names":5,"comments":0,"pivot_tables":0},"unopened":[],"bounds":{"document_bytes":16777216,"sheet_cells":100000,"rows_first":2000,"rows_last":500,"rows_between":2000,"halvings":0,"cell_chars":16384,"cell_head_chars":4096},"cells_cut":0,"cells_raw":0,"read":"whole","date_system":"1900"}

{"sheet":"Start","index":0,"n_rows":18,"n_cols":4,"rows_kept":18,"cut":false,"hidden":false,"merged":[]}
[]
[null,"TKC Seniorencompetitie - 2023/2024"]
[]
[null,"Invoeren uitslagen","Dag 1","Overzicht Standen"]
[null,null,"Dag 2"]
[null,null,"Dag 3"]
[null,null,"Dag 4"]
[null,null,"Dag 5"]
[null,null,"Dag 6"]
[null,null,"Dag 7"]
[null,null,"Dag 8"]
[null,null,"Dag 9"]
[null,null,"Dag 10"]
[null,null,"Dag 11"]
[null,null,"Dag 12"]
[null,null,"Dag 13"]
[null,null,"Dag 14"]
[null,null,"Dag 15"]

{"sheet":"Stand","index":1,"n_rows":48,"n_cols":11,"rows_kept":48,"cut":false,"hidden":false,"merged":[]}
[]
["TKC Seniorencompetitie 2023-2024    Standen",null,null,null,null,null,null,null,"start"]
[]
[]
[]
["1e Klasse",null,null,null,null,null,"2e Klasse"]
["1.",{"$f":"'1e klasse'!J4","v":"Gunne 1"},{"$f":"'1e klasse'!K4","v":14},{"$f":"'1e klasse'!L9","v":"-"},{"$f":"'1e klasse'!M4","v":52},null,"1.","Brink 3",{"$f":"'2e klasse'!K9","v":14},{"$f":"'2e klasse'!L9","v":"-"},{"$f":"'2e klasse'!M9","v":45}]
["2.",{"$f":"'1e klasse'!J10","v":"Soasel 1"},{"$f":"'1e klasse'!K10","v":14},{"$f":"'1e klasse'!L5","v":"-"},{"$f":"'1e klasse'!M10","v":44},null,"2.","Soasel 3",{"$f":"'2e klasse'!K4","v":14},{"$f":"'2e klasse'!L4","v":"-"},{"$f":"'2e klasse'!M4","v":45}]
["3.",{"$f":"'1e klasse'!J8","v":"O.Ootmarsum 5"},{"$f":"'1e klasse'!K8","v":14},{"$f":"'1e klasse'!L7","v":"-"},{"$f":"'1e klasse'!M8","v":34},null,"3.",{"$f":"'2e klasse'!J6","v":"Gunne 3"},{"$f":"'2e klasse'!K6","v":14},{"$f":"'2e klasse'!L6","v":"-"},{"$f":"'2e klasse'!M6","v":31}]
["4.",{"$f":"'1e klasse'!J11","v":"Soasel 2"},{"$f":"'1e klasse'!K11","v":14},{"$f":"'1e klasse'!L4","v":"-"},{"$f":"'1e klasse'!M11","v":25},null,"4.",{"$f":"'2e klasse'!J11","v":"Wilskracht 3"},{"$f":"'2e klasse'!K11","v":14},null,{"$f":"'2e klasse'!M11","v":26}]
["5.",{"$f":"'1e klasse'!J5","v":"Gunne 2"},{"$f":"'1e klasse'!K5","v":14},{"$f":"'1e klasse'!L10","v":"-"},{"$f":"'1e klasse'!M5","v":23},null,"5.",{"$f":"'2e klasse'!J5","v":"Brink 4"},{"$f":"'2e klasse'!K5","v":14},{"$f":"'2e klasse'!L5","v":"-"},{"$f":"'2e klasse'!M5","v":24}]
["6.",{"$f":"'1e klasse'!J7","v":"Lattr. Brekl. 4"},{"$f":"'1e klasse'!K7","v":14},{"$f":"'1e klasse'!L8","v":"-"},{"$f":"'1e klasse'!M7","v":21},null,"6.",{"$f":"'2e klasse'!J8","v":"Hertme 6"},{"$f":"'2e klasse'!K8","v":14},{"$f":"'2e klasse'!L8","v":"-"},{"$f":"'2e klasse'!M8","v":22}]
["7.",{"$f":"'1e klasse'!J9","v":"O.Ootmarsum 6"},{"$f":"'1e klasse'!K9","v":14},{"$f":"'1e klasse'!L6","v":"-"},{"$f":"'1e klasse'!M9","v":17},null,"7.",{"$f":"'2e klasse'!J7","v":"Hertme 5"},{"$f":"'2e klasse'!K7","v":14},{"$f":"'2e klasse'!L7","v":"-"},{"$f":"'2e klasse'!M7","v":20}]
["8.",{"$f":"'1e klasse'!J6","v":"Hertme 4"},{"$f":"'1e klasse'!K6","v":14},{"$f":"'1e klasse'!L9","v":"-"},{"$f":"'1e klasse'!M6","v":8},null,"8.",{"$f":"'2e klasse'!J10","v":"Soasel 4"},{"$f":"'2e klasse'!K10","v":14},{"$f":"'2e klasse'!L10","v":"-"},{"$f":"'2e klasse'!M10","v":11}]
[null,null,{"$f":"SUM(C7:C14)","v":112},null,{"$f":"SUM(E7:E14)","v":224},null,null,null,{"$f":"SUM(I7:I14)","v":112},null,{"$f":"SUM(K7:K14)","v":224}]
[]
["3e Klasse",null,null,null,null,null,"4e Klasse"]
["1.",{"$f":"'3e klasse'!J6","v":"Lattr. Brekl. 5"},{"$f":"'3e klasse'!K6","v":12},{"$f":"'3e klasse'!L6","v":"-"},{"$f":"'3e klasse'!M6","v":38},null,"1.",{"$f":"'4e klasse'!J9","v":"O.Ootmarsum 8"},{"$f":"'4e klasse'!K9","v":12},{"$f":"'4e klasse'!L9","v":"-"},{"$f":"'4e klasse'!M9","v":44}]
["2.",{"$f":"'3e klasse'!J11","v":"Wilskracht 4"},{"$f":"'3e klasse'!K11","v":12},{"$f":"'3e klasse'!L11","v":"-"},{"$f":"'3e klasse'!M11","v":27},null,"2.",{"$f":"'4e klasse'!J8","v":"O.Ootmarsum 7"},{"$f":"'4e klasse'!K8","v":12},{"$f":"'4e klasse'!L8","v":"-"},{"$f":"'4e klasse'!M8","v":36}]
["3.",{"$f":"'3e klasse'!J9","v":"Soasel 5"},{"$f":"'3e klasse'!K9","v":12},{"$f":"'3e klasse'!L9","v":"-"},{"$f":"'3e klasse'!M9","v":24},null,"3.",{"$f":"'4e klasse'!J6","v":"Lattr. Brekl. 6"},{"$f":"'4e klasse'!K6","v":12},{"$f":"'4e klasse'!L6","v":"-"},{"$f":"'4e klasse'!M6","v":25}]
["4.",{"$f":"'3e klasse'!J4","v":"Gunne 4"},{"$f":"'3e klasse'!K4","v":12},{"$f":"'3e klasse'!L4","v":"-"},{"$f":"'3e klasse'!M4","v":23},null,"4.",{"$f":"'4e klasse'!J5","v":"Hertme 8"},{"$f":"'4e klasse'!K5","v":12},{"$f":"'4e klasse'!L5","v":"-"},{"$f":"'4e klasse'!M5","v":24}]
["5.",{"$f":"'3e klasse'!J7","v":"Nijstad 2"},{"$f":"'3e klasse'!K7","v":12},{"$f":"'3e klasse'!L7","v":"-"},{"$f":"'3e klasse'!M7","v":21},null,"5.",{"$f":"'4e klasse'!J7","v":"Lattr. Brekl. 7"},{"$f":"'4e klasse'!K7","v":12},{"$f":"'4e klasse'!L7","v":"-"},{"$f":"'4e klasse'!M7","v":21}]
["6.",{"$f":"'3e klasse'!J8","v":"Nijstad 3"},{"$f":"'3e klasse'!K8","v":12},{"$f":"'3e klasse'!L8","v":"-"},{"$f":"'3e klasse'!M8","v":20},null,"6.",{"$f":"'4e klasse'!J10","v":"Soasel 6"},{"$f":"'4e klasse'!K10","v":12},{"$f":"'4e klasse'!L10","v":"-"},{"$f":"'4e klasse'!M10","v":14}]
["7.",{"$f":"'3e klasse'!J5","v":"H.K.V. 1"},{"$f":"'3e klasse'!K5","v":12},{"$f":"'3e klasse'!L5","v":"-"},{"$f":"'3e klasse'!M5","v":15},null,"7.",{"$f":"'4e klasse'!J4","v":"Hertme 7"},{"$f":"'4e klasse'!K4","v":12},{"$f":"'4e klasse'!L4","v":"-"},{"$f":"'4e klasse'!M4","v":4}]
["8.",{"$f":"'3e klasse'!J10","v":"vrij"},{"$f":"'3e klasse'!K10","v":0},{"$f":"'3e klasse'!L10","v":"-"},{"$f":"'3e klasse'!M10","v":0},null,"8.",{"$f":"'4e klasse'!J11","v":"vrij"},{"$f":"'4e klasse'!K11","v":0},{"$f":"'4e klasse'!L11","v":"-"},{"$f":"'4e klasse'!M11","v":0}]
[null,null,{"$f":"SUM(C18:C25)","v":84},null,{"$f":"SUM(E18:E25)","v":168},null,null,null,{"$f":"SUM(I18:I25)","v":84},null,{"$f":"SUM(K18:K25)","v":168}]
[]
["5e Klasse",null,null,null,null,null,"6e Klasse"]
["1.",{"$f":"'5e klasse'!J9","v":"O.Ootmarsum 9"},{"$f":"'5e klasse'!K9","v":12},{"$f":"'5e klasse'!L9","v":"-"},{"$f":"'5e klasse'!M9","v":44},null,"1.",{"$f":"'6e klasse'!J4","v":"Brink 5"},{"$f":"'6e klasse'!K4","v":15},{"$f":"'6e klasse'!L4","v":"-"},{"$f":"'6e klasse'!M4","v":54}]
["2.",{"$f":"'5e klasse'!J8","v":"O.Ootmarsum 10"},{"$f":"'5e klasse'!K8","v":12},{"$f":"'5e klasse'!L8","v":"-"},{"$f":"'5e klasse'!M8","v":26},null,"2.",{"$f":"'6e klasse'!J9","v":"Wilskracht 5"},{"$f":"'6e klasse'!K9","v":15},{"$f":"'6e klasse'!L9","v":"-"},{"$f":"'6e klasse'!M9","v":38}]
["3.",{"$f":"'5e klasse'!J4","v":"Gunne 5"},{"$f":"'5e klasse'!K4","v":12},{"$f":"'5e klasse'!L4","v":"-"},{"$f":"'5e klasse'!M4","v":25},null,"3.",{"$f":"'6e klasse'!J6","v":"Lattr. Brekl. 9"},{"$f":"'6e klasse'!K6","v":15},{"$f":"'6e klasse'!L6","v":"-"},{"$f":"'6e klasse'!M6","v":33}]
["4.",{"$f":"'5e klasse'!J7","v":"Nijstad 4"},{"$f":"'5e klasse'!K7","v":12},{"$f":"'5e klasse'!L7","v":"-"},{"$f":"'5e klasse'!M7","v":23},null,"4.",{"$f":"'6e klasse'!J5","v":"Hertme 10"},{"$f":"'6e klasse'!K5","v":15},{"$f":"'6e klasse'!L5","v":"-"},{"$f":"'6e klasse'!M5","v":25}]
["5.",{"$f":"'5e klasse'!J10","v":"Soasel 7"},{"$f":"'5e klasse'!K10","v":12},{"$f":"'5e klasse'!L10","v":"-"},{"$f":"'5e klasse'!M10","v":21},null,"5.",{"$f":"'6e klasse'!J8","v":"Soasel 8"},{"$f":"'6e klasse'!K8","v":15},{"$f":"'6e klasse'!L8","v":"-"},{"$f":"'6e klasse'!M8","v":18}]
["6.",{"$f":"'5e klasse'!J5","v":"Hertme 9"},{"$f":"'5e klasse'!K5","v":12},{"$f":"'5e klasse'!L5","v":"-"},{"$f":"'5e klasse'!M5","v":16},null,"6.",{"$f":"'6e klasse'!J7","v":"O.Ootmarsum 11"},{"$f":"'6e klasse'!K7","v":15},{"$f":"'6e klasse'!L7","v":"-"},{"$f":"'6e klasse'!M7","v":12}]
["7.",{"$f":"'5e klasse'!J6","v":"Lattr. Brekl. 8"},{"$f":"'5e klasse'!K6","v":12},{"$f":"'5e klasse'!L6","v":"-"},{"$f":"'5e klasse'!M6","v":13}]
["8.",{"$f":"'5e klasse'!J11","v":"vrij"},{"$f":"'5e klasse'!K11","v":0},{"$f":"'5e klasse'!L11","v":"-"},{"$f":"'5e klasse'!M11","v":0}]
[null,null,{"$f":"SUM(C29:C36)","v":84},null,{"$f":"SUM(E29:E36)","v":168},null,null,null,{"$f":"SUM(I29:I36)","v":90},null,{"$f":"SUM(K29:K36)","v":180}]
[]
["7e Klasse"]
["1.",{"$f":"'7e klasse'!J6","v":"Hertme 11"},{"$f":"'7e klasse'!K6","v":15},{"$f":"'7e klasse'!L6","v":"-"},{"$f":"'7e klasse'!M6","v":49}]
["2.",{"$f":"'7e klasse'!J8","v":"Lattr. Brekl. 10"},{"$f":"'7e klasse'!K8","v":15},{"$f":"'7e klasse'!L8","v":"-"},{"$f":"'7e klasse'!M8","v":38}]
["3.",{"$f":"'7e klasse'!J7","v":"Hertme 12"},{"$f":"'7e klasse'!K7","v":15},{"$f":"'7e klasse'!L7","v":"-"},{"$f":"'7e klasse'!M7","v":34}]
["4.",{"$f":"'7e klasse'!J4","v":"Brink 6"},{"$f":"'7e klasse'!K4","v":15},{"$f":"'7e klasse'!L4","v":"-"},{"$f":"'7e klasse'!M4","v":28}]
["5.",{"$f":"'7e klasse'!J9","v":"Nijstad 5"},{"$f":"'7e klasse'!K9","v":15},{"$f":"'7e klasse'!L9","v":"-"},{"$f":"'7e klasse'!M9","v":17}]
["6.",{"$f":"'7e klasse'!J5","v":"Gunne 6"},{"$f":"'7e klasse'!K5","v":15},{"$f":"'7e klasse'!L5","v":"-"},{"$f":"'7e klasse'!M5","v":14}]
[]
[]
[null,null,{"$f":"SUM(C40:C47)","v":90},null,{"$f":"SUM(E40:E47)","v":180},null,null,null,{"$f":"SUM(I46:I47)","v":0},null,{"$f":"SUM(K46:K47)","v":0}]

{"sheet":"Wedstr. 1","index":2,"n_rows":47,"n_cols":18,"rows_kept":47,"cut":false,"hidden":false,"merged":[]}
["1e Speeldag",null,"Start",null,null,null,null,"Senioren"]
[]
[]
["1e Klasse",null,null,null,null,null,null,"2e Klasse",null,null,null,null,null,null,{"$f":"LEFT(A4,4)","v":"1e K"},{"$f":"LEFT(C4,4)","v":""},{"$f":"LEFT(H4,4)","v":"2e K"},{"$f":"LEFT(J4,4)","v":""}]
[null,null,null,null,null,null,null,null,null,null,null,null,null,null,{"$f":"LEFT(A5,4)","v":""},{"$f":"LEFT(C5,4)","v":""},{"$f":"LEFT(H5,4)","v":""},{"$f":"LEFT(J5,4)","v":""}]
[{"$f":"'1e klasse'!A15","v":"Soasel 2"},{"$f":"'1e klasse'!B15","v":"-"},{"$f":"'1e klasse'!C15","v":"Gunne 1"},0,"-",4,null,{"$f":"'2e klasse'!A15","v":"Brink 4"},{"$f":"'2e klasse'!B15","v":"-"},{"$f":"'2e klasse'!C15","v":"Gunne 3"},2,{"$f":"'2e klasse'!E15","v":"-"},2,null,"Soas","Gunn","Brin","Gunn"]
[{"$f":"'1e klasse'!A16","v":"Gunne 2"},{"$f":"'1e klasse'!B16","v":"-"},{"$f":"'1e klasse'!C16","v":"O.Ootmarsum 5"},3,"-",1,null,{"$f":"'2e klasse'!A16","v":"Wilskracht 3"},{"$f":"'2e klasse'!B16","v":"-"},{"$f":"'2e klasse'!C16","v":"Soasel 4"},4,{"$f":"'2e klasse'!E16","v":"-"},0,null,"Gunn","O.Oo","Wils","Soas"]
[{"$f":"'1e klasse'!A17","v":"O.Ootmarsum 6"},{"$f":"'1e klasse'!B17","v":"-"},{"$f":"'1e klasse'!C17","v":"Lattr. Brekl. 4"},1,"-",3,null,{"$f":"'2e klasse'!A17","v":"Soasel 3"},{"$f":"'2e klasse'!B17","v":"-"},{"$f":"'2e klasse'!C17","v":"Hertme 6"},3,{"$f":"'2e klasse'!E17","v":"-"},1,null,"O.Oo","Latt","Soas","Hert"]
[{"$f":"'1e klasse'!A18","v":"Hertme 4"},{"$f":"'1e klasse'!B18","v":"-"},{"$f":"'1e klasse'!C18","v":"Soasel 1"},0,"-",4,null,{"$f":"'2e klasse'!A18","v":"Hertme 5"},{"$f":"'2e klasse'!B18","v":"-"},{"$f":"'2e klasse'!C18","v":"Brink 3"},0,{"$f":"'2e klasse'!E18","v":"-"},4,null,"Hert","Soas","Hert","Brin"]
[null,null,null,null,null,null,null,null,null,null,null,null,null,null,"","","",""]
["3e klasse",null,null,null,null,null,null,"4e klasse",null,null,null,null,null,null,"3e k","","4e k",""]
[null,null,null,null,null,null,null,null,null,null,null,null,null,null,"","","",""]
[{"$f":"'3e klasse'!A15","v":"Soasel 5"},{"$f":"'3e klasse'!B15","v":"-"},{"$f":"'3e klasse'!C15","v":"vrij"},null,{"$f":"'3e klasse'!E15","v":"-"},null,null,{"$f":"'4e klasse'!A15","v":"vrij"},{"$f":"'4e klasse'!B15","v":"-"},{"$f":"'4e klasse'!C15","v":"Lattr. Brekl. 7"},null,{"$f":"'4e klasse'!E15","v":"-"},null,null,"Soas","vrij","vrij","Latt"]
[{"$f":"'3e klasse'!A16","v":"Gunne 4"},{"$f":"'3e klasse'!B16","v":"-"},{"$f":"'3e klasse'!C16","v":"Nijstad 2"},3,{"$f":"'3e klasse'!E16","v":"-"},1,null,{"$f":"'4e klasse'!A16","v":"Lattr. Brekl. 6"},{"$f":"'4e klasse'!B16","v":"-"},{"$f":"'4e klasse'!C16","v":"O.Ootmarsum 7"},0,{"$f":"'4e klasse'!E16","v":"-"},4,null,"Gunn","Nijs","Latt","O.Oo"]
[{"$f":"'3e klasse'!A17","v":"Nijstad 3"},{"$f":"'3e klasse'!B17","v":"-"},{"$f":"'3e klasse'!C17","v":"H.K.V. 1"},4,{"$f":"'3e klasse'!E17","v":"-"},0,null,{"$f":"'4e klasse'!A17","v":"O.Ootmarsum 8"},{"$f":"'4e klasse'!B17","v":"-"},{"$f":"'4e klasse'!C17","v":"Hertme 7"},4,{"$f":"'4e klasse'!E17","v":"-"},0,null,"Nijs","H.K.","O.Oo","Hert"]
[{"$f":"'3e klasse'!A18","v":"Lattr. Brekl. 5"},{"$f":"'3e klasse'!B18","v":"-"},{"$f":"'3e klasse'!C18","v":"Wilskracht 4"},4,{"$f":"'3e klasse'!E18","v":"-"},0,null,{"$f":"'4e klasse'!A18","v":"Hertme 8"},{"$f":"'4e klasse'!B18","v":"-"},{"$f":"'4e klasse'!C18","v":"Soasel 6"},3,{"$f":"'4e klasse'!E18","v":"-"},1,null,"Latt","Wils","Hert","Soas"]
[null,null,null,null,null,null,null,null,null,null,null,null,null,null,"","","",""]
["5e klasse",null,null,null,null,null,null,"6e klasse",null,null,null,null,null,null,"5e k","","6e k",""]
[null,null,null,null,null,null,null,null,null,null,null,null,null,null,"","","",""]
[{"$f":"'5e klasse'!A15","v":"Soasel 7"},{"$f":"'5e klasse'!B15","v":"-"},{"$f":"'5e klasse'!C15","v":"vrij"},null,{"$f":"'3e klasse'!E22","v":"-"},null,null,{"$f":"'6e klasse'!A15","v":"Hertme 10"},{"$f":"'6e klasse'!B15","v":"-"},{"$f":"'6e klasse'!C15","v":"Lattr. Brekl. 9"},2,{"$f":"'4e klasse'!E22","v":"-"},2,null,"Soas","vrij","Hert","Latt"]
[{"$f":"'5e klasse'!A16","v":"Gunne 5"},{"$f":"'5e klasse'!B16","v":"-"},{"$f":"'5e klasse'!C16","v":"O.Ootmarsum 10"},4,{"$f":"'3e klasse'!E23","v":"-"},0,null,{"$f":"'6e klasse'!A16","v":"Wilskracht 5"},{"$f":"'6e klasse'!B16","v":"-"},{"$f":"'6e klasse'!C16","v":"Soasel 8"},4,{"$f":"'4e klasse'!E23","v":"-"},0,null,"Gunn","O.Oo","Wils","Soas"]
[{"$f":"'5e klasse'!A17","v":"O.Ootmarsum 9"},{"$f":"'5e klasse'!B17","v":"-"},{"$f":"'5e klasse'!C17","v":"Hertme 9"},4,{"$f":"'3e klasse'!E24","v":"-"},0,null,{"$f":"'6e klasse'!A17","v":"Brink 5"},{"$f":"'6e klasse'!B17","v":"-"},{"$f":"'6e klasse'!C17","v":"O.Ootmarsum 11"},2,{"$f":"'4e klasse'!E24","v":"-"},2,null,"O.Oo","Hert","Brin","O.Oo"]
[{"$f":"'5e klasse'!A18","v":"Nijstad 4"},{"$f":"'5e klasse'!B18","v":"-"},{"$f":"'5e klasse'!C18","v":"Lattr. Brekl. 8"},0,{"$f":"'3e klasse'!E25","v":"-"},4,null,null,null,null,null,{"$f":"'4e klasse'!E25","v":"-"},null,null,"Nijs","Latt","",""]
[null,null,null,null,null,null,null,null,null,null,null,null,null,null,"","","",""]
["7e klasse",null,null,null,null,null,null,null,null,null,null,null,null,null,"7e k","","",""]
[null,null,null,null,null,null,null,null,null,null,null,null,null,null,"","","",""]
[{"$f":"'7e klasse'!A15","v":"Gunne 6"},{"$f":"'7e klasse'!B15","v":"-"},{"$f":"'7e klasse'!C15","v":"Brink 6"},3,{"$f":"'5e klasse'!E15","v":"-"},1,null,null,null,null,null,null,null,null,"Gunn","Brin","",""]
[{"$f":"'7e klasse'!A16","v":"Hertme 12"},{"$f":"'7e klasse'!B16","v":"-"},{"$f":"'7e klasse'!C16","v":"Nijstad 5"},4,{"$f":"'5e klasse'!E16","v":"-"},0,null,null,null,null,null,null,null,null,"Hert","Nijs","",""]
[{"$f":"'7e klasse'!A17","v":"Lattr. Brekl. 10"},{"$f":"'7e klasse'!B17","v":"-"},{"$f":"'7e klasse'!C17","v":"Hertme 11"},2,{"$f":"'5e klasse'!E17","v":"-"},2,null,null,null,null,null,null,null,null,"Latt","Hert","",""]
[null,null,null,null,null,null,null,null,null,null,null,{"$f":"'4e klasse'!E32","v":"-"},null,null,"","","",""]
[]
[]
[]
[]
[null,null,"Thuis",null,null,null,null,"Uit",null,"Totaal",null,null,null,"Opgave"]
["Brink",null,{"$f":"COUNTIF($O$4:$O$30,LEFT(A36,4))+COUNTIF($Q$4:$Q$30,LEFT(A36,4))","v":2},null,null,null,null,{"$f":"COUNTIF($P$4:$P$30,LEFT(A36,4))+COUNTIF($R$4:$R$30,LEFT(A36,4))","v":2},null,{"$f":"C36+H36","v":4},null,null,null,7]
["Gunne",null,4,null,null,null,null,2,null,{"$f":"C37+H37","v":6},null,null,null,8]
["H.K.V.",null,0,null,null,null,null,1,null,1,null,null,null,4]
["Hertme",null,5,null,null,null,null,4,null,9,null,null,null,9]
["Lattr. Brekl.",null,3,null,null,null,null,4,null,7,null,null,null,10]
["Nijstad",null,2,null,null,null,null,2,null,4,null,null,null,7]
["O.Ootmarsum",null,3,null,null,null,null,4,null,7,null,null,null,12]
["Soasel",null,4,null,null,null,null,4,null,8,null,null,null,4]
["Vijfsprong",null,0,null,null,null,null,0,null,0,null,null,null,3]
["Wilskracht",null,2,null,null,null,null,1,null,3,null,null,null,6]
[]
[null,null,{"$f":"SUM(C36:C46)","v":25},null,null,null,null,{"$f":"SUM(H36:H46)","v":24},null,{"$f":"SUM(J36:J46)","v":49},null,null,null,{"$f":"SUM(N36:N46)","v":70}]

{"sheet":"wedstr. 2","index":3,"n_rows":53,"n_cols":18,"rows_kept":53,"cut":false,"hidden":false,"merged":[]}
["2e Speeldag",null,"Start",null,null,null,null,"senioren"]
[]
[]
["1e Klasse",null,null,null,null,null,null,"2e Klasse",null,null,null,null,null,null,{"$f":"LEFT(A4,4)","v":"1e K"},{"$f":"LEFT(C4,4)","v":""},{"$f":"LEFT(H4,4)","v":"2e K"},{"$f":"LEFT(J4,4)","v":""}]
[null,null,null,null,null,null,null,null,null,null,null,null,null,null,{"$f":"LEFT(A5,4)","v":""},{"$f":"LEFT(C5,4)","v":""},{"$f":"LEFT(H5,4)","v":""},{"$f":"LEFT(J5,4)","v":""}]
[{"$f":"'1e klasse'!A22","v":"Gunne 1"},{"$f":"'1e klasse'!B22","v":"-"},{"$f":"'1e klasse'!C22","v":"Gunne 2"},3,"-",1,null,{"$f":"'2e klasse'!A22","v":"Gunne 3"},{"$f":"'2e klasse'!B22","v":"-"},{"$f":"'2e klasse'!C22","v":"Wilskracht 3"},4,"-",0,null,"Gunn","Gunn","Gunn","Wils"]
[{"$f":"'1e klasse'!A23","v":"O.Ootmarsum 5"},{"$f":"'1e klasse'!B23","v":"-"},{"$f":"'1e klasse'!C23","v":"O.Ootmarsum 6"},3,"-",1,null,{"$f":"'2e klasse'!A23","v":"Soasel 4"},{"$f":"'2e klasse'!B23","v":"-"},{"$f":"'2e klasse'!C23","v":"Soasel 3"},0,"-",4,null,"O.Oo","O.Oo","Soas","Soas"]
[{"$f":"'1e klasse'!A24","v":"Lattr. Brekl. 4"},{"$f":"'1e klasse'!B24","v":"-"},{"$f":"'1e klasse'!C24","v":"Hertme 4"},4,"-",0,null,{"$f":"'2e klasse'!A24","v":"Hertme 6"},{"$f":"'2e klasse'!B24","v":"-"},{"$f":"'2e klasse'!C24","v":"Hertme 5"},2,"-",2,null,"Latt","Hert","Hert","Hert"]
[{"$f":"'1e klasse'!A25","v":"Soasel 1"},{"$f":"'1e klasse'!B25","v":"-"},{"$f":"'1e klasse'!C25","v":"Soasel 2"},4,"-",0,null,{"$f":"'2e klasse'!A25","v":"Brink 3"},{"$f":"'2e klasse'!B25","v":"-"},{"$f":"'2e klasse'!C25","v":"Brink 4"},3,"-",1,null,"Soas","Soas","Brin","Brin"]
[null,null,null,null,null,null,null,null,null,null,null,null,null,null,"","","",""]
["3e klasse",null,null,null,null,null,null,"4e klasse",null,null,null,null,null,null,"3e k","","4e k",""]
[null,null,null,null,null,null,null,null,null,null,null,null,null,null,"","","",""]
[{"$f":"'3e klasse'!A22","v":"vrij"},{"$f":"'3e klasse'!B22","v":"-"},{"$f":"'3e klasse'!C22","v":"Gunne 4"},null,"-",null,null,{"$f":"'4e klasse'!A22","v":"Lattr. Brekl. 7"},{"$f":"'4e klasse'!B22","v":"-"},{"$f":"'4e klasse'!C22","v":"Lattr. Brekl. 6"},0,"-",4,null,"vrij","Gunn","Latt","Latt"]
[{"$f":"'3e klasse'!A23","v":"Nijstad 2"},{"$f":"'3e klasse'!B23","v":"-"},{"$f":"'3e klasse'!C23","v":"Nijstad 3"},4,"-",0,null,{"$f":"'4e klasse'!A23","v":"O.Ootmarsum 7"},{"$f":"'4e klasse'!B23","v":"-"},{"$f":"'4e klasse'!C23","v":"O.Ootmarsum 8"},0,"-",4,null,"Nijs","Nijs","O.Oo","O.Oo"]
[{"$f":"'3e klasse'!A24","v":"H.K.V. 1"},{"$f":"'3e klasse'!B24","v":"-"},{"$f":"'3e klasse'!C24","v":"Lattr. Brekl. 5"},0,"-",4,null,{"$f":"'4e klasse'!A24","v":"Hertme 7"},{"$f":"'4e klasse'!B24","v":"-"},{"$f":"'4e klasse'!C24","v":"Hertme 8"},0,"-",4,null,"H.K.","Latt","Hert","Hert"]
[{"$f":"'3e klasse'!A25","v":"Wilskracht 4"},{"$f":"'3e klasse'!B25","v":"-"},{"$f":"'3e klasse'!C25","v":"Soasel 5"},0,"-",4,null,{"$f":"'4e klasse'!A25","v":"Soasel 6"},{"$f":"'4e klasse'!B25","v":"-"},{"$f":"'4e klasse'!C25","v":"vrij"},null,"-",null,null,"Wils","Soas","Soas","vrij"]
[null,null,null,null,null,null,null,null,null,null,null,null,null,null,"","","",""]
["5e klasse",null,null,null,null,null,null,"6e klasse",null,null,null,null,null,null,"5e k","","6e k",""]
[null,null,null,null,null,null,null,null,null,null,null,null,null,null,"","","",""]
[{"$f":"'5e klasse'!A22","v":"vrij"},{"$f":"'5e klasse'!B22","v":"-"},{"$f":"'5e klasse'!C22","v":"Gunne 5"},null,"-",null,null,{"$f":"'6e klasse'!A21","v":"Soasel 8"},{"$f":"'6e klasse'!B21","v":"-"},{"$f":"'6e klasse'!C21","v":"Hertme 10"},2,"-",2,null,"vrij","Gunn","Soas","Hert"]
[{"$f":"'5e klasse'!A23","v":"O.Ootmarsum 10"},{"$f":"'5e klasse'!B23","v":"-"},{"$f":"'5e klasse'!C23","v":"O.Ootmarsum 9"},0,"-",4,null,{"$f":"'6e klasse'!A22","v":"O.Ootmarsum 11"},{"$f":"'6e klasse'!B22","v":"-"},{"$f":"'6e klasse'!C22","v":"Wilskracht 5"},1,"-",3,null,"O.Oo","O.Oo","O.Oo","Wils"]
[{"$f":"'5e klasse'!A24","v":"Hertme 9"},{"$f":"'5e klasse'!B24","v":"-"},{"$f":"'5e klasse'!C24","v":"Nijstad 4"},1,"-",3,null,{"$f":"'6e klasse'!A23","v":"Lattr. Brekl. 9"},{"$f":"'6e klasse'!B23","v":"-"},{"$f":"'6e klasse'!C23","v":"Brink 5"},0,"-",4,null,"Hert","Nijs","Latt","Brin"]
[{"$f":"'5e klasse'!A25","v":"Lattr. Brekl. 8"},{"$f":"'5e klasse'!B25","v":"-"},{"$f":"'5e klasse'!C25","v":"Soasel 7"},0,"-",4,null,{"$f":"'6e klasse'!A24","v":" "},{"$f":"'6e klasse'!B24","v":" "},{"$f":"'6e klasse'!C24","v":" "},null,"-",null,null,"Latt","Soas"," "," "]
[null,null,null,null,null,null,null,null,null,null,null,null,null,null,"","","",""]
["7e klasse",null,null,null,null,null,null,null,null,null,null,null,null,null,"7e k","","",""]
[null,null,null,null,null,null,null,null,null,null,null,null,null,null,"","","",""]
[{"$f":"'7e klasse'!A21","v":"Nijstad 5"},{"$f":"'7e klasse'!B21","v":"-"},{"$f":"'7e klasse'!C21","v":"Gunne 6"},2,"-",2,null,null,null,null,null,"-",null,null,"Nijs","Gunn","",""]
[{"$f":"'7e klasse'!A22","v":"Hertme 11"},{"$f":"'7e klasse'!B22","v":"-"},{"$f":"'7e klasse'!C22","v":"Hertme 12"},0,"-",4,null,null,null,null,null,"-",null,null,"Hert","Hert","",""]
[{"$f":"'7e klasse'!A23","v":"Brink 6"},{"$f":"'7e klasse'!B23","v":"-"},{"$f":"'7e klasse'!C23","v":"Lattr. Brekl. 10"},0,"-",4,null,null,null,null,null,"-",null,null,"Brin","Latt","",""]
[]
[]
[]
[]
[]
[null,null,"Thuis",null,null,null,null,"Uit",null,"Totaal"]
["Brink",null,{"$f":"COUNTIF($O$4:$O$30,LEFT(A36,4))+COUNTIF($Q$4:$Q$30,LEFT(A36,4))","v":2},null,null,null,null,{"$f":"COUNTIF($P$4:$P$30,LEFT(A36,4))+COUNTIF($R$4:$R$30,LEFT(A36,4))","v":2},null,{"$f":"C36+H36","v":4}]
["Gunne",null,2,null,null,null,null,4,null,{"$f":"C37+H37","v":6}]
["H.k.v.",null,1,null,null,null,null,0,null,1]
["Hertme",null,4,null,null,null,null,5,null,9]
["Lattr. Brekl.",null,4,null,null,null,null,3,null,7]
["Nijstad",null,2,null,null,null,null,2,null,4,null,null,null,"Opgave"]
["O.Ootmarsum",null,4,null,null,null,null,3,null,7,null,null,null,4]
["Soasel",null,4,null,null,null,null,4,null,8,null,null,null,9]
["Vijfsprong",null,0,null,null,null,null,0,null,0,null,null,null,10]
["Wilskracht",null,1,null,null,null,null,2,null,3,null,null,null,7]
[null,null,null,null,null,null,null,null,null,null,null,null,null,1]
[null,null,{"$f":"SUM(C36:C46)","v":24},null,null,null,null,{"$f":"SUM(H36:H46)","v":25},null,{"$f":"SUM(J36:J46)","v":49},null,null,null,1]
[null,null,null,null,null,null,null,null,null,null,null,null,null,12]
[null,null,null,null,null,null,null,null,null,null,null,null,null,4]
[null,null,null,null,null,null,null,null,null,null,null,null,null,3]
[null,null,null,null,null,null,null,null,null,null,null,null,null,6]
[]
[null,null,null,null,null,null,null,null,null,null,null,null,null,{"$f":"SUM(N42:N52)","v":57}]

{"sheet":"wedstr. 3","index":4,"n_rows":53,"n_cols":18,"rows_kept":53,"cut":false,"hidden":false,"merged":[]}
["3e Speeldag",null,"Start",null,null,null,null,"senioren"]
[]
[]
["1e Klasse",null,null,null,null,null,null,"3e Klasse",null,null,null,null,null,null,{"$f":"LEFT(A4,4)","v":"1e K"},{"$f":"LEFT(C4,4)","v":""},{"$f":"LEFT(H4,4)","v":"3e K"},{"$f":"LEFT(J4,4)","v":""}]
[null,null,null,null,null,null,null,null,null,null,null,null,null,null,{"$f":"LEFT(A5,4)","v":""},{"$f":"LEFT(C5,4)","v":""},{"$f":"LEFT(H5,4)","v":""},{"$f":"LEFT(J5,4)","v":""}]
[{"$f":"'1e klasse'!A30","v":"Soasel 2"},{"$f":"'1e klasse'!B30","v":"-"},{"$f":"'1e klasse'!C30","v":"O.Ootmarsum 5"},1,"-",3,null,{"$f":"'2e klasse'!A30","v":"Brink 4"},{"$f":"'2e klasse'!B30","v":"-"},{"$f":"'2e klasse'!C30","v":"Soasel 4"},4,"-",0,null,"Soas","O.Oo","Brin","Soas"]
[{"$f":"'1e klasse'!A31","v":"Gunne 2"},{"$f":"'1e klasse'!B31","v":"-"},{"$f":"'1e klasse'!C31","v":"Lattr. Brekl. 4"},1,"-",3,null,{"$f":"'2e klasse'!A31","v":"Wilskracht 3"},{"$f":"'2e klasse'!B31","v":"-"},{"$f":"'2e klasse'!C31","v":"Hertme 6"},4,"-",0,null,"Gunn","Latt","Wils","Hert"]
[{"$f":"'1e klasse'!A32","v":"O.Ootmarsum 6"},{"$f":"'1e klasse'!B32","v":"-"},{"$f":"'1e klasse'!C32","v":"Soasel 1"},1,"-",3,null,{"$f":"'2e klasse'!A32","v":"Soasel 3"},{"$f":"'2e klasse'!B32","v":"-"},{"$f":"'2e klasse'!C32","v":"Brink 3"},1,"-",3,null,"O.Oo","Soas","Soas","Brin"]
[{"$f":"'1e klasse'!A33","v":"Hertme 4"},{"$f":"'1e klasse'!B33","v":"-"},{"$f":"'1e klasse'!C33","v":"Gunne 1"},0,"-",4,null,{"$f":"'2e klasse'!A33","v":"Hertme 5"},{"$f":"'2e klasse'!B33","v":"-"},{"$f":"'2e klasse'!C33","v":"Gunne 3"},3,"-",1,null,"Hert","Gunn","Hert","Gunn"]
[null,null,null,null,null,null,null,null,null,null,null,null,null,null,"","","",""]
["3e klasse",null,null,null,null,null,null,"4e klasse",null,null,null,null,null,null,"3e k","","4e k",""]
[null,null,null,null,null,null,null,null,null,null,null,null,null,null,"","","",""]
[{"$f":"'3e klasse'!A30","v":"Soasel 5"},{"$f":"'3e klasse'!B30","v":"-"},{"$f":"'3e klasse'!C30","v":"Nijstad 2"},4,"-",0,null,{"$f":"'4e klasse'!A30","v":"vrij"},{"$f":"'4e klasse'!B30","v":"-"},{"$f":"'4e klasse'!C30","v":"O.Ootmarsum 7"},null,"-",null,null,"Soas","Nijs","vrij","O.Oo"]
[{"$f":"'3e klasse'!A31","v":"Gunne 4"},{"$f":"'3e klasse'!B31","v":"-"},{"$f":"'3e klasse'!C31","v":"H.K.V. 1"},2,"-",2,null,{"$f":"'4e klasse'!A31","v":"Lattr. Brekl. 6"},{"$f":"'4e klasse'!B31","v":"-"},{"$f":"'4e klasse'!C31","v":"Hertme 7"},4,"-",0,null,"Gunn","H.K.","Latt","Hert"]
[{"$f":"'3e klasse'!A32","v":"Nijstad 3"},{"$f":"'3e klasse'!B32","v":"-"},{"$f":"'3e klasse'!C32","v":"Wilskracht 4"},0,"-",4,null,{"$f":"'4e klasse'!A32","v":"O.Ootmarsum 8"},{"$f":"'4e klasse'!B32","v":"-"},{"$f":"'4e klasse'!C32","v":"Soasel 6"},4,"-",0,null,"Nijs","Wils","O.Oo","Soas"]
[{"$f":"'3e klasse'!A33","v":"Lattr. Brekl. 5"},{"$f":"'3e klasse'!B33","v":"-"},{"$f":"'3e klasse'!C33","v":"vrij"},null,"-",null,null,{"$f":"'4e klasse'!A33","v":"Hertme 8"},{"$f":"'4e klasse'!B33","v":"-"},{"$f":"'4e klasse'!C33","v":"Lattr. Brekl. 7"},2,"-",2,null,"Latt","vrij","Hert","Latt"]
[null,null,null,null,null,null,null,null,null,null,null,null,null,null,"","","",""]
["5e klasse",null,null,null,null,null,null,"6e klasse",null,null,null,null,null,null,"5e k","","6e k",""]
[null,null,null,null,null,null,null,null,null,null,null,null,null,null,"","","",""]
[{"$f":"'5e klasse'!A30","v":"Soasel 7"},{"$f":"'5e klasse'!B30","v":"-"},{"$f":"'5e klasse'!C30","v":"O.Ootmarsum 10"},1,"-",3,null,{"$f":"'6e klasse'!A27","v":"Hertme 10"},{"$f":"'6e klasse'!B27","v":"-"},{"$f":"'6e klasse'!C27","v":"Wilskracht 5"},0,"-",4,null,"Soas","O.Oo","Hert","Wils"]
[{"$f":"'5e klasse'!A31","v":"Gunne 5"},{"$f":"'5e klasse'!B31","v":"-"},{"$f":"'5e klasse'!C31","v":"Hertme 9"},1,"-",3,null,{"$f":"'6e klasse'!A28","v":"Brink 5"},{"$f":"'6e klasse'!B28","v":"-"},{"$f":"'6e klasse'!C28","v":"Soasel 8"},4,null,0,null,"Gunn","Hert","Brin","Soas"]
[{"$f":"'5e klasse'!A32","v":"O.Ootmarsum 9"},{"$f":"'5e klasse'!B32","v":"-"},{"$f":"'5e klasse'!C32","v":"Lattr. Brekl. 8"},4,"-",0,null,{"$f":"'6e klasse'!A29","v":"O.Ootmarsum 11"},{"$f":"'6e klasse'!B29","v":"-"},{"$f":"'6e klasse'!C29","v":"Lattr. Brekl. 9"},0,"-",4,null,"O.Oo","Latt","O.Oo","Latt"]
[{"$f":"'5e klasse'!A33","v":"Nijstad 4"},{"$f":"'5e klasse'!B33","v":"-"},{"$f":"'5e klasse'!C33","v":"vrij"},null,"-",null,null,null,null,null,null,"-",null,null,"Nijs","vrij","",""]
[null,null,null,null,null,null,null,null,null,null,null,null,null,null,"","","",""]
["7e klasse",null,null,null,null,null,null,null,null,null,null,null,null,null,"7e k","","",""]
[null,null,null,null,null,null,null,null,null,null,null,null,null,null,"","","",""]
[{"$f":"'7e klasse'!A27","v":"Gunne 6"},{"$f":"'7e klasse'!B27","v":"-"},{"$f":"'7e klasse'!C27","v":"Hertme 12"},1,"-",3,null,null,null,null,null,"-",null,null,"Gunn","Hert","",""]
[{"$f":"'7e klasse'!A28","v":"Lattr. Brekl. 10"},{"$f":"'7e klasse'!B28","v":"-"},{"$f":"'7e klasse'!C28","v":"Nijstad 5"},3,"-",1,null,null,null,null,null,"-",null,null,"Latt","Nijs","",""]
[{"$f":"'7e klasse'!A29","v":"Hertme 11"},{"$f":"'7e klasse'!B29","v":"-"},{"$f":"'7e klasse'!C29","v":"Brink 6"},2,"-",2,null,null,null,null,null,"-",null,null,"Hert","Brin","",""]
[]
[]
[]
[]
[]
[null,null,"Thuis",null,null,null,null,"Uit",null,"Totaal"]
["Brink",null,{"$f":"COUNTIF($O$4:$O$30,LEFT(A36,4))+COUNTIF($Q$4:$Q$30,LEFT(A36,4))","v":2},null,null,null,null,{"$f":"COUNTIF($P$4:$P$30,LEFT(A36,4))+COUNTIF($R$4:$R$30,LEFT(A36,4))","v":2},null,{"$f":"C36+H36","v":4}]
["Gunne",null,4,null,null,null,null,2,null,{"$f":"C37+H37","v":6}]
["H.K.V.",null,0,null,null,null,null,1,null,1]
["Hertme",null,5,null,null,null,null,4,null,9]
["Lattr. Brekl.",null,3,null,null,null,null,4,null,7]
["Nijstad",null,2,null,null,null,null,2,null,4,null,null,null,"Opgave"]
["O.Ootmarsum",null,4,null,null,null,null,3,null,7,null,null,null,4]
["Soasel",null,4,null,null,null,null,4,null,8,null,null,null,9]
["Vijfsprong",null,0,null,null,null,null,0,null,0,null,null,null,10]
["Wilskracht",null,1,null,null,null,null,2,null,3,null,null,null,7]
[null,null,null,null,null,null,null,null,null,null,null,null,null,1]
[null,null,{"$f":"SUM(C36:C46)","v":25},null,null,null,null,{"$f":"SUM(H36:H46)","v":24},null,{"$f":"SUM(J36:J46)","v":49},null,null,null,1]
[null,null,null,null,null,null,null,null,null,null,null,null,null,12]
[null,null,null,null,null,null,null,null,null,null,null,null,null,4]
[null,null,null,null,null,null,null,null,null,null,null,null,null,3]
[null,null,null,null,null,null,null,null,null,null,null,null,null,6]
[]
[null,null,null,null,null,null,null,null,null,null,null,null,null,{"$f":"SUM(N42:N52)","v":57}]

{"sheet":"wedstr. 4","index":5,"n_rows":52,"n_cols":18,"rows_kept":52,"cut":false,"hidden":false,"merged":[]}
["4e Speeldag",null,"Start",null,null,null,null,"senioren"]
[]
[]
["1e Klasse",null,null,null,null,null,null,"2e Klasse",null,null,null,null,null,null,{"$f":"LEFT(A4,4)","v":"1e K"},{"$f":"LEFT(C4,4)","v":""},{"$f":"LEFT(H4,4)","v":"2e K"},{"$f":"LEFT(J4,4)","v":""}]
[null,null,null,null,null,null,null,null,null,null,null,null,null,null,{"$f":"LEFT(A5,4)","v":""},{"$f":"LEFT(C5,4)","v":""},{"$f":"LEFT(H5,4)","v":""},{"$f":"LEFT(J5,4)","v":""}]
[{"$f":"'1e klasse'!A38","v":"Gunne 1"},{"$f":"'1e klasse'!B38","v":"-"},{"$f":"'1e klasse'!C38","v":"O.Ootmarsum 6"},4,"-",0,null,{"$f":"'2e klasse'!A38","v":"Gunne 3"},{"$f":"'2e klasse'!B38","v":"-"},{"$f":"'2e klasse'!C38","v":"Soasel 3"},0,"-",4,null,"Gunn","O.Oo","Gunn","Soas"]
[{"$f":"'1e klasse'!A39","v":"O.Ootmarsum 5"},{"$f":"'1e klasse'!B39","v":"-"},{"$f":"'1e klasse'!C39","v":"Hertme 4"},4,"-",0,null,{"$f":"'2e klasse'!A39","v":"Soasel 4"},{"$f":"'2e klasse'!B39","v":"-"},{"$f":"'2e klasse'!C39","v":"Hertme 5"},2,"-",2,null,"O.Oo","Hert","Soas","Hert"]
[{"$f":"'1e klasse'!A40","v":"Lattr. Brekl. 4"},{"$f":"'1e klasse'!B40","v":"-"},{"$f":"'1e klasse'!C40","v":"Soasel 2"},3,"-",1,null,{"$f":"'2e klasse'!A40","v":"Hertme 6"},{"$f":"'2e klasse'!B40","v":"-"},{"$f":"'2e klasse'!C40","v":"Brink 4"},2,"-",2,null,"Latt","Soas","Hert","Brin"]
[{"$f":"'1e klasse'!A41","v":"Soasel 1"},{"$f":"'1e klasse'!B41","v":"-"},{"$f":"'1e klasse'!C41","v":"Gunne 2"},3,"-",1,null,{"$f":"'2e klasse'!A41","v":"Brink 3"},{"$f":"'2e klasse'!B41","v":"-"},{"$f":"'2e klasse'!C41","v":"Wilskracht 3"},3,"-",1,null,"Soas","Gunn","Brin","Wils"]
[null,null,null,null,null,null,null,null,null,null,null,null,null,null,"","","",""]
["3e klasse",null,null,null,null,null,null,"4e klasse",null,null,null,null,null,null,"3e k","","4e k",""]
[null,null,null,null,null,null,null,null,null,null,null,null,null,null,"","","",""]
[{"$f":"'3e klasse'!A38","v":"vrij"},{"$f":"'3e klasse'!B38","v":"-"},{"$f":"'3e klasse'!C38","v":"Nijstad 3"},null,"-",null,null,{"$f":"'4e klasse'!A38","v":"Lattr. Brekl. 7"},{"$f":"'4e klasse'!B38","v":"-"},{"$f":"'4e klasse'!C38","v":"O.Ootmarsum 8"},2,"-",2,null,"vrij","Nijs","Latt","O.Oo"]
[{"$f":"'3e klasse'!A39","v":"Nijstad 2"},{"$f":"'3e klasse'!B39","v":"-"},{"$f":"'3e klasse'!C39","v":"Lattr. Brekl. 5"},2,"-",2,null,{"$f":"'4e klasse'!A39","v":"O.Ootmarsum 7"},{"$f":"'4e klasse'!B39","v":"-"},{"$f":"'4e klasse'!C39","v":"Hertme 8"},4,"-",0,null,"Nijs","Latt","O.Oo","Hert"]
[{"$f":"'3e klasse'!A40","v":"H.K.V. 1"},{"$f":"'3e klasse'!B40","v":"-"},{"$f":"'3e klasse'!C40","v":"Soasel 5"},1,"-",3,null,{"$f":"'4e klasse'!A40","v":"Hertme 7"},{"$f":"'4e klasse'!B40","v":"-"},{"$f":"'4e klasse'!C40","v":"vrij"},null,"-",null,null,"H.K.","Soas","Hert","vrij"]
[{"$f":"'3e klasse'!A41","v":"Wilskracht 4"},{"$f":"'3e klasse'!B41","v":"-"},{"$f":"'3e klasse'!C41","v":"Gunne 4"},3,"-",1,null,{"$f":"'4e klasse'!A41","v":"Soasel 6"},{"$f":"'4e klasse'!B41","v":"-"},{"$f":"'4e klasse'!C41","v":"Lattr. Brekl. 6"},0,"-",4,null,"Wils","Gunn","Soas","Latt"]
[null,null,null,null,null,null,null,null,null,null,null,null,null,null,"","","",""]
["5e klasse",null,null,null,null,null,null,"6e klasse",null,null,null,null,null,null,"5e k","","6e k",""]
[null,null,null,null,null,null,null,null,null,null,null,null,null,null,"","","",""]
[{"$f":"'5e klasse'!A38","v":"vrij"},{"$f":"'5e klasse'!B38","v":"-"},{"$f":"'5e klasse'!C38","v":"O.Ootmarsum 9"},null,"-",null,null,{"$f":"'6e klasse'!A33","v":"Brink 5"},{"$f":"'6e klasse'!B33","v":"-"},{"$f":"'6e klasse'!C33","v":"Hertme 10"},3,"-",1,null,"vrij","O.Oo","Brin","Hert"]
[{"$f":"'5e klasse'!A39","v":"O.Ootmarsum 10"},{"$f":"'5e klasse'!B39","v":"-"},{"$f":"'5e klasse'!C39","v":"Nijstad 4"},2,"-",2,null,{"$f":"'6e klasse'!A34","v":"Wilskracht 5"},{"$f":"'6e klasse'!B34","v":"-"},{"$f":"'6e klasse'!C34","v":"Lattr. Brekl. 9"},2,"-",2,null,"O.Oo","Nijs","Wils","Latt"]
[{"$f":"'5e klasse'!A40","v":"Hertme 9"},{"$f":"'5e klasse'!B40","v":"-"},{"$f":"'5e klasse'!C40","v":"Soasel 7"},1,"-",3,null,{"$f":"'6e klasse'!A35","v":"Soasel 8"},{"$f":"'6e klasse'!B35","v":"-"},{"$f":"'6e klasse'!C35","v":"O.Ootmarsum 11"},1,"-",3,null,"Hert","Soas","Soas","O.Oo"]
[{"$f":"'5e klasse'!A41","v":"Lattr. Brekl. 8"},{"$f":"'5e klasse'!B41","v":"-"},{"$f":"'5e klasse'!C41","v":"Gunne 5"},2,"-",2,null,null,null,null,null,"-",null,null,"Latt","Gunn","",""]
[null,null,null,null,null,null,null,null,null,null,null,null,null,null,"","","",""]
["7e klasse",null,null,null,null,null,null,null,null,null,null,null,null,null,"7e k","","",""]
[null,null,null,null,null,null,null,null,null,null,null,null,null,null,"","","",""]
[{"$f":"'7e klasse'!A33","v":"Lattr. Brekl. 10"},{"$f":"'7e klasse'!B33","v":"-"},{"$f":"'7e klasse'!C33","v":"Gunne 6"},4,"-",0,null,null,null,null,null,"-",null,null,"Latt","Gunn","",""]
[{"$f":"'7e klasse'!A34","v":"Hertme 12"},{"$f":"'7e klasse'!B34","v":"-"},{"$f":"'7e klasse'!C34","v":"Brink 6"},3,"-",1,null,null,null,null,null,"-",null,null,"Hert","Brin","",""]
[{"$f":"'7e klasse'!A35","v":"Nijstad 5"},{"$f":"'7e klasse'!B35","v":"-"},{"$f":"'7e klasse'!C35","v":"Hertme 11"},0,"-",4,null,null,null,null,null,"-",null,null,"Nijs","Hert","",""]
[]
[]
[]
[]
[]
[null,null,"Thuis",null,null,null,null,"Uit",null,"Totaal"]
["Brink",null,{"$f":"COUNTIF($O$4:$O$30,LEFT(A36,4))+COUNTIF($Q$4:$Q$30,LEFT(A36,4))","v":2},null,null,null,null,{"$f":"COUNTIF($P$4:$P$30,LEFT(A36,4))+COUNTIF($R$4:$R$30,LEFT(A36,4))","v":2},null,{"$f":"C36+H36","v":4}]
["Gunne",null,2,null,null,null,null,4,null,{"$f":"C37+H37","v":6}]
["H.K.V.",null,1,null,null,null,null,0,null,1]
["Hertme",null,4,null,null,null,null,5,null,9]
["Lattr. Brekl.",null,4,null,null,null,null,3,null,7,null,null,null,"Opgave"]
["Nijstad",null,2,null,null,null,null,2,null,4,null,null,null,7]
["O.Ootmarsum",null,3,null,null,null,null,4,null,7,null,null,null,9]
["Soasel",null,4,null,null,null,null,4,null,8,null,null,null,10]
["Vijfsprong",null,0,null,null,null,null,0,null,0,null,null,null,7]
["Wilskracht",null,2,null,null,null,null,1,null,3,null,null,null,1]
[null,null,null,null,null,null,null,null,null,null,null,null,null,1]
[null,null,{"$f":"SUM(C36:C46)","v":24},null,null,null,null,{"$f":"SUM(H36:H46)","v":25},null,{"$f":"SUM(J36:J46)","v":49},null,null,null,12]
[null,null,null,null,null,null,null,null,null,null,null,null,null,4]
[null,null,null,null,null,null,null,null,null,null,null,null,null,3]
[null,null,null,null,null,null,null,null,null,null,null,null,null,6]
[]
[null,null,null,null,null,null,null,null,null,null,null,null,null,{"$f":"SUM(N41:N51)","v":60}]

{"sheet":"wedstr. 5","index":6,"n_rows":52,"n_cols":18,"rows_kept":52,"cut":false,"hidden":false,"merged":[]}
["5e Speeldag",null,"Start",null,null,null,null,"senioren"]
[]
[]
["1e Klasse",null,null,null,null,null,null,"2e Klasse",null,null,null,null,null,null,{"$f":"LEFT(A4,4)","v":"1e K"},{"$f":"LEFT(C4,4)","v":""},{"$f":"LEFT(H4,4)","v":"2e K"},{"$f":"LEFT(J4,4)","v":""}]
[null,null,null,null,null,null,null,null,null,null,null,null,null,null,{"$f":"LEFT(A5,4)","v":""},{"$f":"LEFT(C5,4)","v":""},{"$f":"LEFT(H5,4)","v":""},{"$f":"LEFT(J5,4)","v":""}]
[{"$f":"'1e klasse'!A46","v":"Soasel 2"},{"$f":"'1e klasse'!B38","v":"-"},{"$f":"'1e klasse'!C46","v":"Gunne 2"},3,"-",1,null,{"$f":"'2e klasse'!A46","v":"Brink 4"},{"$f":"'2e klasse'!B46","v":"-"},{"$f":"'2e klasse'!C46","v":"Wilskracht 3"},0,"-",4,null,"Soas","Gunn","Brin","Wils"]
[{"$f":"'1e klasse'!A47","v":"Gunne 1"},{"$f":"'1e klasse'!B39","v":"-"},{"$f":"'1e klasse'!C47","v":"O.Ootmarsum 5"},4,"-",0,null,{"$f":"'2e klasse'!A47","v":"Gunne 3"},{"$f":"'2e klasse'!B47","v":"-"},{"$f":"'2e klasse'!C47","v":"Soasel 4"},3,"-",1,null,"Gunn","O.Oo","Gunn","Soas"]
[{"$f":"'1e klasse'!A48","v":"O.Ootmarsum 6"},{"$f":"'1e klasse'!B40","v":"-"},{"$f":"'1e klasse'!C48","v":"Hertme 4"},3,"-",1,null,{"$f":"'2e klasse'!A48","v":"Soasel 3"},{"$f":"'2e klasse'!B48","v":"-"},{"$f":"'2e klasse'!C48","v":"Hertme 5"},4,"-",0,null,"O.Oo","Hert","Soas","Hert"]
[{"$f":"'1e klasse'!A49","v":"Lattr. Brekl. 4"},{"$f":"'1e klasse'!B41","v":"-"},{"$f":"'1e klasse'!C49","v":"Soasel 1"},0,"-",4,null,{"$f":"'2e klasse'!A49","v":"Hertme 6"},{"$f":"'2e klasse'!B49","v":"-"},{"$f":"'2e klasse'!C49","v":"Brink 3"},1,"-",3,null,"Latt","Soas","Hert","Brin"]
[null,null,null,null,null,null,null,null,null,null,null,null,null,null,"","","",""]
["3e klasse",null,null,null,null,null,null,"4e klasse",null,null,null,null,null,null,"3e k","","4e k",""]
[null,null,null,null,null,null,null,null,null,null,null,null,null,null,"","","",""]
[{"$f":"'3e klasse'!A46","v":"Soasel 5"},{"$f":"'3e klasse'!B46","v":"-"},{"$f":"'3e klasse'!C46","v":"Gunne 4"},1,"-",3,null,{"$f":"'4e klasse'!A46","v":"vrij"},{"$f":"'4e klasse'!B46","v":"-"},{"$f":"'4e klasse'!C46","v":"Lattr. Brekl. 6"},null,"-",null,null,"Soas","Gunn","vrij","Latt"]
[{"$f":"'3e klasse'!A47","v":"vrij"},{"$f":"'3e klasse'!B47","v":"-"},{"$f":"'3e klasse'!C47","v":"Nijstad 2"},null,"-",null,null,{"$f":"'4e klasse'!A47","v":"Lattr. Brekl. 7"},{"$f":"'4e klasse'!B47","v":"-"},{"$f":"'4e klasse'!C47","v":"O.Ootmarsum 7"},2,"-",2,null,"vrij","Nijs","Latt","O.Oo"]
[{"$f":"'3e klasse'!A48","v":"Nijstad 3"},{"$f":"'3e klasse'!B48","v":"-"},{"$f":"'3e klasse'!C48","v":"Lattr. Brekl. 5"},0,"-",4,null,{"$f":"'4e klasse'!A48","v":"O.Ootmarsum 8"},{"$f":"'4e klasse'!B48","v":"-"},{"$f":"'4e klasse'!C48","v":"Hertme 8"},4,"-",0,null,"Nijs","Latt","O.Oo","Hert"]
[{"$f":"'3e klasse'!A49","v":"H.K.V. 1"},{"$f":"'3e klasse'!B49","v":"-"},{"$f":"'3e klasse'!C49","v":"Wilskracht 4"},2,"-",2,null,{"$f":"'4e klasse'!A49","v":"Hertme 7"},{"$f":"'4e klasse'!B49","v":"-"},{"$f":"'4e klasse'!C49","v":"Soasel 6"},2,"-",2,null,"H.K.","Wils","Hert","Soas"]
[null,null,null,null,null,null,null,null,null,null,null,null,null,null,"","","",""]
["5e klasse",null,null,null,null,null,null,"6e klasse",null,null,null,null,null,null,"5e k","","6e k",""]
[null,null,null,null,null,null,null,null,null,null,null,null,null,null,"","","",""]
[{"$f":"'5e klasse'!A46","v":"Soasel 7"},{"$f":"'5e klasse'!B46","v":"-"},{"$f":"'5e klasse'!C46","v":"Gunne 5"},2,"-",2,null,{"$f":"'6e klasse'!A39","v":"Wilskracht 5"},{"$f":"'6e klasse'!B39","v":"-"},{"$f":"'6e klasse'!C39","v":"Brink 5"},0,"-",4,null,"Soas","Gunn","Wils","Brin"]
[{"$f":"'5e klasse'!A47","v":"vrij"},{"$f":"'5e klasse'!B47","v":"-"},{"$f":"'5e klasse'!C47","v":"O.Ootmarsum 10"},null,"-",null,null,{"$f":"'6e klasse'!A40","v":"Hertme 10"},{"$f":"'6e klasse'!B40","v":"-"},{"$f":"'6e klasse'!C40","v":"O.Ootmarsum 11"},4,"-",0,null,"vrij","O.Oo","Hert","O.Oo"]
[{"$f":"'5e klasse'!A48","v":"O.Ootmarsum 9"},{"$f":"'5e klasse'!B48","v":"-"},{"$f":"'5e klasse'!C48","v":"Nijstad 4"},4,"-",0,null,{"$f":"'6e klasse'!A41","v":"Lattr. Brekl. 9"},{"$f":"'6e klasse'!B41","v":"-"},{"$f":"'6e klasse'!C41","v":"Soasel 8"},3,"-",1,null,"O.Oo","Nijs","Latt","Soas"]
[{"$f":"'5e klasse'!A49","v":"Hertme 9"},{"$f":"'5e klasse'!B49","v":"-"},{"$f":"'5e klasse'!C49","v":"Lattr. Brekl. 8"},2,"-",2,null,null,null,null,null,"-",null,null,"Hert","Latt","",""]
[null,null,null,null,null,null,null,null,null,null,null,null,null,null,"","","",""]
["7e klasse",null,null,null,null,null,null,null,null,null,null,null,null,null,"7e k","","",""]
[null,null,null,null,null,null,null,null,null,null,null,null,null,null,"","","",""]
[{"$f":"'7e klasse'!A39","v":"Hertme 12"},{"$f":"'7e klasse'!B39","v":"-"},{"$f":"'7e klasse'!C39","v":"Lattr. Brekl. 10"},3,"-",1,null,null,null,null,null,"-",null,null,"Hert","Latt","",""]
[{"$f":"'7e klasse'!A40","v":"Gunne 6"},{"$f":"'7e klasse'!B40","v":"-"},{"$f":"'7e klasse'!C40","v":"Hertme 11"},0,"-",4,null,null,null,null,null,"-",null,null,"Gunn","Hert","",""]
[{"$f":"'7e klasse'!A41","v":"Brink 6"},{"$f":"'7e klasse'!B41","v":"-"},{"$f":"'7e klasse'!C41","v":"Nijstad 5"},4,"-",0,null,null,null,null,null,"-",null,null,"Brin","Nijs","",""]
[]
[]
[]
[]
[]
[null,null,"Thuis",null,null,null,null,"Uit",null,"Totaal"]
["Brink",null,{"$f":"COUNTIF($O$4:$O$30,LEFT(A36,4))+COUNTIF($Q$4:$Q$30,LEFT(A36,4))","v":2},null,null,null,null,{"$f":"COUNTIF($P$4:$P$30,LEFT(A36,4))+COUNTIF($R$4:$R$30,LEFT(A36,4))","v":2},null,{"$f":"C36+H36","v":4}]
["Gunne",null,3,null,null,null,null,3,null,{"$f":"C37+H37","v":6}]
["H.K.V.",null,1,null,null,null,null,0,null,1]
["Hertme",null,5,null,null,null,null,4,null,9]
["Lattr. Brekl.",null,3,null,null,null,null,4,null,7,null,null,null,"Opgave"]
["Nijstad",null,1,null,null,null,null,3,null,4,null,null,null,7]
["O.Ootmarsum",null,3,null,null,null,null,4,null,7,null,null,null,9]
["Soasel",null,4,null,null,null,null,4,null,8,null,null,null,10]
["Vijfsprong",null,0,null,null,null,null,0,null,0,null,null,null,7]
["Wilskracht",null,1,null,null,null,null,2,null,3,null,null,null,1]
[null,null,null,null,null,null,null,null,null,0,null,null,null,1]
[null,null,{"$f":"SUM(C36:C46)","v":23},null,null,null,null,{"$f":"SUM(H36:H46)","v":26},null,{"$f":"SUM(J36:J46)","v":49},null,null,null,12]
[null,null,null,null,null,null,null,null,null,null,null,null,null,4]
[null,null,null,null,null,null,null,null,null,null,null,null,null,3]
[null,null,null,null,null,null,null,null,null,null,null,null,null,6]
[]
[null,null,null,null,null,null,null,null,null,null,null,null,null,{"$f":"SUM(N41:N51)","v":60}]

{"sheet":"wedstr. 6","index":7,"n_rows":53,"n_cols":18,"rows_kept":53,"cut":false,"hidden":false,"merged":[]}
["6e Speeldag",null,"Start",null,null,null,null,"senioren"]
[]
[]
["1e Klasse",null,null,null,null,null,null,"2e Klasse",null,null,null,null,null,null,{"$f":"LEFT(A4,4)","v":"1e K"},{"$f":"LEFT(C4,4)","v":""},{"$f":"LEFT(H4,4)","v":"2e K"},{"$f":"LEFT(J4,4)","v":""}]
[null,null,null,null,null,null,null,null,null,null,null,null,null,null,{"$f":"LEFT(A5,4)","v":""},{"$f":"LEFT(C5,4)","v":""},{"$f":"LEFT(H5,4)","v":""},{"$f":"LEFT(J5,4)","v":""}]
[{"$f":"'1e klasse'!A54","v":"Gunne 2"},{"$f":"'1e klasse'!B54","v":"-"},{"$f":"'1e klasse'!C54","v":"O.Ootmarsum 6"},4,"-",0,null,{"$f":"'2e klasse'!A54","v":"Wilskracht 3"},{"$f":"'2e klasse'!B54","v":"-"},{"$f":"'2e klasse'!C54","v":"Soasel 3"},1,"-",3,null,"Gunn","O.Oo","Wils","Soas"]
[{"$f":"'1e klasse'!A55","v":"Hertme 4"},{"$f":"'1e klasse'!B55","v":"-"},{"$f":"'1e klasse'!C55","v":"Soasel 2"},2,"-",2,null,{"$f":"'2e klasse'!A55","v":"Hertme 5"},{"$f":"'2e klasse'!B55","v":"-"},{"$f":"'2e klasse'!C55","v":"Brink 4"},4,"-",0,null,"Hert","Soas","Hert","Brin"]
[{"$f":"'1e klasse'!A56","v":"O.Ootmarsum 5"},{"$f":"'1e klasse'!B56","v":"-"},{"$f":"'1e klasse'!C56","v":"Lattr. Brekl. 4"},4,"-",0,null,{"$f":"'2e klasse'!A56","v":"Soasel 4"},{"$f":"'2e klasse'!B56","v":"-"},{"$f":"'2e klasse'!C56","v":"Hertme 6"},1,"-",3,null,"O.Oo","Latt","Soas","Hert"]
[{"$f":"'1e klasse'!A57","v":"Soasel 1"},{"$f":"'1e klasse'!B57","v":"-"},{"$f":"'1e klasse'!C57","v":"Gunne 1"},2,"-",2,null,{"$f":"'2e klasse'!A57","v":"Brink 3"},{"$f":"'2e klasse'!B57","v":"-"},{"$f":"'2e klasse'!C57","v":"Gunne 3"},2,"-",2,null,"Soas","Gunn","Brin","Gunn"]
[null,null,null,null,null,null,null,null,null,null,null,null,null,null,"","","",""]
["3e klasse",null,null,null,null,null,null,"4e klasse",null,null,null,null,null,null,"3e k","","4e k",""]
[null,null,null,null,null,null,null,null,null,null,null,null,null,null,"","","",""]
[{"$f":"'3e klasse'!A54","v":"Gunne 4"},{"$f":"'3e klasse'!B54","v":"-"},{"$f":"'3e klasse'!C54","v":"Nijstad 3"},4,"-",0,null,{"$f":"'4e klasse'!A54","v":"Lattr. Brekl. 6"},{"$f":"'4e klasse'!B54","v":"-"},{"$f":"'4e klasse'!C54","v":"O.Ootmarsum 8"},0,"-",4,null,"Gunn","Nijs","Latt","O.Oo"]
[{"$f":"'3e klasse'!A55","v":"Lattr. Brekl. 5"},{"$f":"'3e klasse'!B55","v":"-"},{"$f":"'3e klasse'!C55","v":"Soasel 5"},4,"-",0,null,{"$f":"'4e klasse'!A55","v":"Hertme 8"},{"$f":"'4e klasse'!B55","v":"-"},{"$f":"'4e klasse'!C55","v":"vrij"},null,"-",null,null,"Latt","Soas","Hert","vrij"]
[{"$f":"'3e klasse'!A56","v":"Nijstad 2"},{"$f":"'3e klasse'!B56","v":"-"},{"$f":"'3e klasse'!C56","v":"H.K.V. 1"},3,"-",1,null,{"$f":"'4e klasse'!A56","v":"O.Ootmarsum 7"},{"$f":"'4e klasse'!B56","v":"-"},{"$f":"'4e klasse'!C56","v":"Hertme 7"},4,"-",0,null,"Nijs","H.K.","O.Oo","Hert"]
[{"$f":"'3e klasse'!A57","v":"Wilskracht 4"},{"$f":"'3e klasse'!B57","v":"-"},{"$f":"'3e klasse'!C57","v":"vrij"},null,"-",null,null,{"$f":"'4e klasse'!A57","v":"Soasel 6"},{"$f":"'4e klasse'!B57","v":"-"},{"$f":"'4e klasse'!C57","v":"Lattr. Brekl. 7"},1,"-",3,null,"Wils","vrij","Soas","Latt"]
[null,null,null,null,null,null,null,null,null,null,null,null,null,null,"","","",""]
["5e klasse",null,null,null,null,null,null,"6e klasse",null,null,null,null,null,null,"5e k","","6e k",""]
[null,null,null,null,null,null,null,null,null,null,null,null,null,null,"","","",""]
[{"$f":"'5e klasse'!A54","v":"Gunne 5"},{"$f":"'5e klasse'!B54","v":"-"},{"$f":"'5e klasse'!C54","v":"O.Ootmarsum 9"},1,"-",3,null,{"$f":"'6e klasse'!A45","v":"Lattr. Brekl. 9"},{"$f":"'6e klasse'!B45","v":"-"},{"$f":"'6e klasse'!C45","v":"Hertme 10"},4,"-",0,null,"Gunn","O.Oo","Latt","Hert"]
[{"$f":"'5e klasse'!A55","v":"Nijstad 4"},{"$f":"'5e klasse'!B55","v":"-"},{"$f":"'5e klasse'!C55","v":"Soasel 7"},2,null,2,null,{"$f":"'6e klasse'!A46","v":"Soasel 8"},{"$f":"'6e klasse'!B46","v":"-"},{"$f":"'6e klasse'!C46","v":"Wilskracht 5"},0,"-",4,null,"Nijs","Soas","Soas","Wils"]
[{"$f":"'5e klasse'!A56","v":"O.Ootmarsum 10"},{"$f":"'5e klasse'!B56","v":"-"},{"$f":"'5e klasse'!C56","v":"Hertme 9"},4,"-",0,null,{"$f":"'6e klasse'!A47","v":"O.Ootmarsum 11"},{"$f":"'6e klasse'!B47","v":"-"},{"$f":"'6e klasse'!C47","v":"Brink 5"},0,"-",4,null,"O.Oo","Hert","O.Oo","Brin"]
[{"$f":"'5e klasse'!A57","v":"Lattr. Brekl. 8"},{"$f":"'5e klasse'!B57","v":"-"},{"$f":"'5e klasse'!C57","v":"vrij"},null,"-",null,null,{"$f":"'6e klasse'!A48","v":" "},{"$f":"'6e klasse'!B48","v":" "},{"$f":"'6e klasse'!C48","v":" "},null,"-",null,null,"Latt","vrij"," "," "]
[null,null,null,null,null,null,null,null,null,null,null,null,null,null,"","","",""]
["7e klasse",null,null,null,null,null,null,null,null,null,null,null,null,null,"7e k","","",""]
[null,null,null,null,null,null,null,null,null,null,null,null,null,null,"","","",""]
[{"$f":"'7e klasse'!A45","v":"Brink 6"},{"$f":"'7e klasse'!B45","v":"-"},{"$f":"'7e klasse'!C45","v":"Gunne 6"},4,"-",0,null,null,null,null,null,"-",null,null,"Brin","Gunn","",""]
[{"$f":"'7e klasse'!A46","v":"Nijstad 5"},{"$f":"'7e klasse'!B46","v":"-"},{"$f":"'7e klasse'!C46","v":"Hertme 12"},1,"-",3,null,null,null,null,null,"-",null,null,"Nijs","Hert","",""]
[{"$f":"'7e klasse'!A47","v":"Hertme 11"},{"$f":"'7e klasse'!B47","v":"-"},{"$f":"'7e klasse'!C47","v":"Lattr. Brekl. 10"},4,"-",0,null,null,null,null,null,"-",null,null,"Hert","Latt","",""]
[{"$f":"'7e klasse'!A48","v":" "},{"$f":"'7e klasse'!B48","v":" "},{"$f":"'7e klasse'!C48","v":" "},null,"-",null,null,{"$f":"'6e klasse'!A48","v":" "},{"$f":"'6e klasse'!B48","v":" "},{"$f":"'6e klasse'!C48","v":" "},null,"-",null,null," "," "," "," "]
[]
[]
[]
[]
[null,null,"Thuis",null,null,null,null,"Uit",null,"Totaal"]
["Brink",null,{"$f":"COUNTIF($O$4:$O$30,LEFT(A36,4))+COUNTIF($Q$4:$Q$30,LEFT(A36,4))","v":2},null,null,null,null,{"$f":"COUNTIF($P$4:$P$30,LEFT(A36,4))+COUNTIF($R$4:$R$30,LEFT(A36,4))","v":2},null,{"$f":"C36+H36","v":4}]
["Gunne",null,3,null,null,null,null,3,null,{"$f":"C37+H37","v":6}]
["H.K.V.",null,0,null,null,null,null,1,null,1]
["Hertme",null,4,null,null,null,null,5,null,9]
["Lattr. Brekl.",null,4,null,null,null,null,3,null,7]
["Nijstad",null,3,null,null,null,null,1,null,4,null,null,null,"Opgave"]
["O.Ootmarsum",null,4,null,null,null,null,3,null,7,null,null,null,4]
["Soasel",null,4,null,null,null,null,4,null,8,null,null,null,9]
["Vijfsprong",null,0,null,null,null,null,0,null,0,null,null,null,10]
["Wilskracht",null,2,null,null,null,null,1,null,3,null,null,null,7]
[null,null,null,null,null,null,null,null,null,null,null,null,null,1]
[null,null,{"$f":"SUM(C36:C46)","v":26},null,null,null,null,{"$f":"SUM(H36:H46)","v":23},null,{"$f":"SUM(J36:J46)","v":49},null,null,null,1]
[null,null,null,null,null,null,null,null,null,null,null,null,null,12]
[null,null,null,null,null,null,null,null,null,null,null,null,null,4]
[null,null,null,null,null,null,null,null,null,null,null,null,null,3]
[null,null,null,null,null,null,null,null,null,null,null,null,null,6]
[]
[null,null,null,null,null,null,null,null,null,null,null,null,null,{"$f":"SUM(N42:N52)","v":57}]

{"sheet":"wedstr. 7","index":8,"n_rows":53,"n_cols":18,"rows_kept":53,"cut":false,"hidden":false,"merged":[]}
["7e Speeldag",null,"Start",null,null,null,null,"senioren"]
[]
[]
["1e Klasse",null,null,null,null,null,null,"2e Klasse",null,null,null,null,null,null,{"$f":"LEFT(A4,4)","v":"1e K"},{"$f":"LEFT(C4,4)","v":""},{"$f":"LEFT(H4,4)","v":"2e K"},{"$f":"LEFT(J4,4)","v":""}]
[null,null,null,null,null,null,null,null,null,null,null,null,null,null,{"$f":"LEFT(A5,4)","v":""},{"$f":"LEFT(C5,4)","v":""},{"$f":"LEFT(H5,4)","v":""},{"$f":"LEFT(J5,4)","v":""}]
[{"$f":"'1e klasse'!A62","v":"Soasel 2"},{"$f":"'1e klasse'!B62","v":"-"},{"$f":"'1e klasse'!C62","v":"O.Ootmarsum 6"},4,"-",0,null,{"$f":"'2e klasse'!A62","v":"Brink 4"},{"$f":"'2e klasse'!B62","v":"-"},{"$f":"'2e klasse'!C62","v":"Soasel 3"},0,"-",4,null,"Soas","O.Oo","Brin","Soas"]
[{"$f":"'1e klasse'!A63","v":"Gunne 1"},{"$f":"'1e klasse'!B63","v":"-"},{"$f":"'1e klasse'!C63","v":"Lattr. Brekl. 4"},4,null,0,null,{"$f":"'2e klasse'!A63","v":"Gunne 3"},{"$f":"'2e klasse'!B63","v":"-"},{"$f":"'2e klasse'!C63","v":"Hertme 6"},4,"-",0,null,"Gunn","Latt","Gunn","Hert"]
[{"$f":"'1e klasse'!A64","v":"O.Ootmarsum 5"},{"$f":"'1e klasse'!B64","v":"-"},{"$f":"'1e klasse'!C64","v":"Soasel 1"},3,"-",1,null,{"$f":"'2e klasse'!A64","v":"Soasel 4"},{"$f":"'2e klasse'!B64","v":"-"},{"$f":"'2e klasse'!C64","v":"Brink 3"},0,"-",4,null,"O.Oo","Soas","Soas","Brin"]
[{"$f":"'1e klasse'!A65","v":"Hertme 4"},{"$f":"'1e klasse'!B65","v":"-"},{"$f":"'1e klasse'!C65","v":"Gunne 2"},0,"-",4,null,{"$f":"'2e klasse'!A65","v":"Hertme 5"},{"$f":"'2e klasse'!B65","v":"-"},{"$f":"'2e klasse'!C65","v":"Wilskracht 3"},0,"-",4,null,"Hert","Gunn","Hert","Wils"]
[null,null,null,null,null,null,null,null,null,null,null,null,null,null,"","","",""]
["3e klasse",null,null,null,null,null,null,"4e klasse",null,null,null,null,null,null,"3e k","","4e k",""]
[null,null,null,null,null,null,null,null,null,null,null,null,null,null,"","","",""]
[{"$f":"'3e klasse'!A62","v":"Soasel 5"},{"$f":"'3e klasse'!B62","v":"-"},{"$f":"'3e klasse'!C62","v":"Nijstad 3"},2,"-",2,null,{"$f":"'4e klasse'!A62","v":"vrij"},{"$f":"'4e klasse'!B62","v":"-"},{"$f":"'4e klasse'!C62","v":"O.Ootmarsum 8"},null,"-",null,null,"Soas","Nijs","vrij","O.Oo"]
[{"$f":"'3e klasse'!A63","v":"vrij"},{"$f":"'3e klasse'!B63","v":"-"},{"$f":"'3e klasse'!C63","v":"H.K.V. 1"},null,"-",null,null,{"$f":"'4e klasse'!A63","v":"Lattr. Brekl. 7"},{"$f":"'4e klasse'!B63","v":"-"},{"$f":"'4e klasse'!C63","v":"Hertme 7"},4,"-",0,null,"vrij","H.K.","Latt","Hert"]
[{"$f":"'3e klasse'!A64","v":"Nijstad 2"},{"$f":"'3e klasse'!B64","v":"-"},{"$f":"'3e klasse'!C64","v":"Wilskracht 4"},3,"-",1,null,{"$f":"'4e klasse'!A64","v":"O.Ootmarsum 7"},{"$f":"'4e klasse'!B64","v":"-"},{"$f":"'4e klasse'!C64","v":"Soasel 6"},4,"-",0,null,"Nijs","Wils","O.Oo","Soas"]
[{"$f":"'3e klasse'!A65","v":"Lattr. Brekl. 5"},{"$f":"'3e klasse'!B65","v":"-"},{"$f":"'3e klasse'!C65","v":"Gunne 4"},2,"-",2,null,{"$f":"'4e klasse'!A65","v":"Hertme 8"},{"$f":"'4e klasse'!B65","v":"-"},{"$f":"'4e klasse'!C65","v":"Lattr. Brekl. 6"},4,"-",0,null,"Latt","Gunn","Hert","Latt"]
[null,null,null,null,null,null,null,null,null,null,null,null,null,null,"","","",""]
["5e klasse",null,null,null,null,null,null,"6e klasse",null,null,null,null,null,null,"5e k","","6e k",""]
[null,null,null,null,null,null,null,null,null,null,null,null,null,null,"","","",""]
[{"$f":"'5e klasse'!A62","v":"Soasel 7"},{"$f":"'5e klasse'!B62","v":"-"},{"$f":"'5e klasse'!C62","v":"O.Ootmarsum 9"},0,"-",4,null,{"$f":"'6e klasse'!A51","v":"Hertme 10"},{"$f":"'6e klasse'!B51","v":"-"},{"$f":"'6e klasse'!C51","v":"Soasel 8"},2,"-",2,null,"Soas","O.Oo","Hert","Soas"]
[{"$f":"'5e klasse'!A63","v":"vrij"},{"$f":"'5e klasse'!B63","v":"-"},{"$f":"'5e klasse'!C63","v":"Hertme 9"},null,"-",null,null,{"$f":"'6e klasse'!A52","v":"Wilskracht 5"},{"$f":"'6e klasse'!B52","v":"-"},{"$f":"'6e klasse'!C52","v":"O.Ootmarsum 11"},4,"-",0,null,"vrij","Hert","Wils","O.Oo"]
[{"$f":"'5e klasse'!A64","v":"O.Ootmarsum 10"},{"$f":"'5e klasse'!B64","v":"-"},{"$f":"'5e klasse'!C64","v":"Lattr. Brekl. 8"},4,"-",0,null,{"$f":"'6e klasse'!A53","v":"Brink 5"},{"$f":"'6e klasse'!B53","v":"-"},{"$f":"'6e klasse'!C53","v":"Lattr. Brekl. 9"},4,"-",0,null,"O.Oo","Latt","Brin","Latt"]
[{"$f":"'5e klasse'!A65","v":"Nijstad 4"},{"$f":"'5e klasse'!B65","v":"-"},{"$f":"'5e klasse'!C65","v":"Gunne 5"},1,"-",3,null,null,null,null,null,"-",null,null,"Nijs","Gunn","",""]
[null,null,null,null,null,null,null,null,null,null,null,null,null,null,"","","",""]
["7e klasse",null,null,null,null,null,null,null,null,null,null,null,null,null,"7e k","","",""]
[null,null,null,null,null,null,null,null,null,null,null,null,null,null,"","","",""]
[{"$f":"'7e klasse'!A51","v":"Gunne 6"},{"$f":"'7e klasse'!B51","v":"-"},{"$f":"'7e klasse'!C51","v":"Nijstad 5"},1,"-",3,null,null,null,null,null,"-",null,null,"Gunn","Nijs","",""]
[{"$f":"'7e klasse'!A52","v":"Hertme 12"},{"$f":"'7e klasse'!B52","v":"-"},{"$f":"'7e klasse'!C52","v":"Hertme 11"},0,"-",4,null,null,null,null,null,"-",null,null,"Hert","Hert","",""]
[{"$f":"'7e klasse'!A53","v":"Lattr. Brekl. 10"},{"$f":"'7e klasse'!B53","v":"-"},{"$f":"'7e klasse'!C53","v":"Brink 6"},4,"-",0,null,null,null,null,null,"-",null,null,"Latt","Brin","",""]
[]
[]
[]
[]
[]
[null,null,"Thuis",null,null,null,null,"Uit",null,"Totaal"]
["Brink",null,{"$f":"COUNTIF($O$4:$O$30,LEFT(A36,4))+COUNTIF($Q$4:$Q$30,LEFT(A36,4))","v":2},null,null,null,null,{"$f":"COUNTIF($P$4:$P$30,LEFT(A36,4))+COUNTIF($R$4:$R$30,LEFT(A36,4))","v":2},null,{"$f":"C36+H36","v":4}]
["Gunne",null,3,null,null,null,null,3,null,{"$f":"C37+H37","v":6}]
["H.K.V.",null,0,null,null,null,null,1,null,1]
["Hertme",null,5,null,null,null,null,4,null,9]
["Lattr. Brekl.",null,3,null,null,null,null,4,null,7]
["Nijstad",null,2,null,null,null,null,2,null,4,null,null,null,"Opgave"]
["O.Ootmarsum",null,3,null,null,null,null,4,null,7,null,null,null,4]
["Soasel",null,4,null,null,null,null,4,null,8,null,null,null,9]
["Vijfsprong",null,0,null,null,null,null,0,null,0,null,null,null,10]
["Wilskracht",null,1,null,null,null,null,2,null,3,null,null,null,7]
[null,null,null,null,null,null,null,null,null,null,null,null,null,1]
[null,null,{"$f":"SUM(C36:C46)","v":23},null,null,null,null,{"$f":"SUM(H36:H46)","v":26},null,{"$f":"SUM(J36:J46)","v":49},null,null,null,1]
[null,null,null,null,null,null,null,null,null,null,null,null,null,12]
[null,null,null,null,null,null,null,null,null,null,null,null,null,4]
[null,null,null,null,null,null,null,null,null,null,null,null,null,3]
[null,null,null,null,null,null,null,null,null,null,null,null,null,6]
[]
[null,null,null,null,null,null,null,null,null,null,null,null,null,{"$f":"SUM(N42:N52)","v":57}]

{"sheet":"wedstr. 8","index":9,"n_rows":53,"n_cols":18,"rows_kept":53,"cut":false,"hidden":false,"merged":[]}
["8e Speeldag",null,"Start",null,null,null,null,"senioren"]
[]
[]
["1e Klasse",null,null,null,null,null,null,"2e Klasse",null,null,null,null,null,null,{"$f":"LEFT(A4,4)","v":"1e K"},{"$f":"LEFT(C4,4)","v":""},{"$f":"LEFT(H4,4)","v":"2e K"},{"$f":"LEFT(J4,4)","v":""}]
[null,null,null,null,null,null,null,null,null,null,null,null,null,null,{"$f":"LEFT(A5,4)","v":""},{"$f":"LEFT(C5,4)","v":""},{"$f":"LEFT(H5,4)","v":""},{"$f":"LEFT(J5,4)","v":""}]
[{"$f":"'1e klasse'!H15","v":"Gunne 1"},{"$f":"'1e klasse'!I15","v":"-"},{"$f":"'1e klasse'!J15","v":"Soasel 2"},4,"-",0,null,{"$f":"'2e klasse'!H15","v":"Gunne 3"},{"$f":"'2e klasse'!I15","v":"-"},{"$f":"'2e klasse'!J15","v":"Brink 4"},3,"-",1,null,"Gunn","Soas","Gunn","Brin"]
[{"$f":"'1e klasse'!H16","v":"O.Ootmarsum 5"},{"$f":"'1e klasse'!I16","v":"-"},{"$f":"'1e klasse'!J16","v":"Gunne 2"},3,"-",1,null,{"$f":"'2e klasse'!H16","v":"Soasel 4"},{"$f":"'2e klasse'!I16","v":"-"},{"$f":"'2e klasse'!J16","v":"Wilskracht 3"},1,"-",3,null,"O.Oo","Gunn","Soas","Wils"]
[{"$f":"'1e klasse'!H17","v":"Lattr. Brekl. 4"},{"$f":"'1e klasse'!I17","v":"-"},{"$f":"'1e klasse'!J17","v":"O.Ootmarsum 6"},1,"-",3,null,{"$f":"'2e klasse'!H17","v":"Hertme 6"},{"$f":"'2e klasse'!I17","v":"-"},{"$f":"'2e klasse'!J17","v":"Soasel 3"},1,"-",3,null,"Latt","O.Oo","Hert","Soas"]
[{"$f":"'1e klasse'!H18","v":"Soasel 1"},{"$f":"'1e klasse'!I18","v":"-"},{"$f":"'1e klasse'!J18","v":"Hertme 4"},4,"-",0,null,{"$f":"'2e klasse'!H18","v":"Brink 3"},{"$f":"'2e klasse'!I18","v":"-"},{"$f":"'2e klasse'!J18","v":"Hertme 5"},4,"-",0,null,"Soas","Hert","Brin","Hert"]
[null,null,null,null,null,null,null,null,null,null,null,null,null,null,"","","",""]
["3e klasse",null,null,null,null,null,null,"4e klasse",null,null,null,null,null,null,"3e k","","4e k",""]
[null,null,null,null,null,null,null,null,null,null,null,null,null,null,"","","",""]
[{"$f":"'3e klasse'!H15","v":"vrij"},{"$f":"'3e klasse'!I15","v":"-"},{"$f":"'3e klasse'!J15","v":"Soasel 5"},null,"-",null,null,{"$f":"'4e klasse'!H15","v":"Lattr. Brekl. 7"},{"$f":"'4e klasse'!I15","v":"-"},{"$f":"'4e klasse'!J15","v":"vrij"},null,"-",null,null,"vrij","Soas","Latt","vrij"]
[{"$f":"'3e klasse'!H16","v":"Nijstad 2"},{"$f":"'3e klasse'!I16","v":"-"},{"$f":"'3e klasse'!J16","v":"Gunne 4"},2,"-",2,null,{"$f":"'4e klasse'!H16","v":"O.Ootmarsum 7"},{"$f":"'4e klasse'!I16","v":"-"},{"$f":"'4e klasse'!J16","v":"Lattr. Brekl. 6"},3,"-",1,null,"Nijs","Gunn","O.Oo","Latt"]
[{"$f":"'3e klasse'!H17","v":"H.K.V. 1"},{"$f":"'3e klasse'!I17","v":"-"},{"$f":"'3e klasse'!J17","v":"Nijstad 3"},1,"-",3,null,{"$f":"'4e klasse'!H17","v":"Hertme 7"},{"$f":"'4e klasse'!I17","v":"-"},{"$f":"'4e klasse'!J17","v":"O.Ootmarsum 8"},0,"-",4,null,"H.K.","Nijs","Hert","O.Oo"]
[{"$f":"'3e klasse'!H18","v":"Wilskracht 4"},{"$f":"'3e klasse'!I18","v":"-"},{"$f":"'3e klasse'!J18","v":"Lattr. Brekl. 5"},1,"-",3,null,{"$f":"'4e klasse'!H18","v":"Soasel 6"},{"$f":"'4e klasse'!I18","v":"-"},{"$f":"'4e klasse'!J18","v":"Hertme 8"},0,"-",4,null,"Wils","Latt","Soas","Hert"]
[null,null,null,null,null,null,null,null,null,null,null,null,null,null,"","","",""]
["5e klasse",null,null,null,null,null,null,"6e klasse",null,null,null,null,null,null,"5e k","","6e k",""]
[null,null,null,null,null,null,null,null,null,null,null,null,null,null,"","","",""]
[{"$f":"'5e klasse'!H15","v":"vrij"},{"$f":"'5e klasse'!I15","v":"-"},{"$f":"'5e klasse'!J15","v":"Soasel 7"},null,"-",null,null,{"$f":"'6e klasse'!A57","v":"Wilskracht 5"},{"$f":"'6e klasse'!B57","v":"-"},{"$f":"'6e klasse'!C57","v":"Hertme 10"},4,"-",0,null,"vrij","Soas","Wils","Hert"]
[{"$f":"'5e klasse'!H16","v":"O.Ootmarsum 10"},{"$f":"'5e klasse'!I16","v":"-"},{"$f":"'5e klasse'!J16","v":"Gunne 5"},1,"-",3,null,{"$f":"'6e klasse'!A58","v":"Soasel 8"},{"$f":"'6e klasse'!B58","v":"-"},{"$f":"'6e klasse'!C58","v":"Brink 5"},0,"-",4,null,"O.Oo","Gunn","Soas","Brin"]
[{"$f":"'5e klasse'!H17","v":"Hertme 9"},{"$f":"'5e klasse'!I17","v":"-"},{"$f":"'5e klasse'!J17","v":"O.Ootmarsum 9"},0,"-",4,null,{"$f":"'6e klasse'!A59","v":"Lattr. Brekl. 9"},{"$f":"'6e klasse'!B59","v":"-"},{"$f":"'6e klasse'!C59","v":"O.Ootmarsum 11"},4,"-",0,null,"Hert","O.Oo","Latt","O.Oo"]
[{"$f":"'5e klasse'!H18","v":"Lattr. Brekl. 8"},{"$f":"'5e klasse'!I18","v":"-"},{"$f":"'5e klasse'!J18","v":"Nijstad 4"},0,"-",4,null,null,null,null,null,"-",null,null,"Latt","Nijs","",""]
[null,null,null,null,null,null,null,null,null,null,null,null,null,null,"","","",""]
["7e klasse",null,null,null,null,null,null,null,null,null,null,null,null,null,"7e k","","",""]
[null,null,null,null,null,null,null,null,null,null,null,null,null,null,"","","",""]
[{"$f":"'7e klasse'!A57","v":"Hertme 12"},{"$f":"'7e klasse'!B57","v":"-"},{"$f":"'7e klasse'!C57","v":"Gunne 6"},2,"-",2,null,null,null,null,null,"-",null,null,"Hert","Gunn","",""]
[{"$f":"'7e klasse'!A58","v":"Nijstad 5"},{"$f":"'7e klasse'!B58","v":"-"},{"$f":"'7e klasse'!C58","v":"Lattr. Brekl. 10"},2,"-",2,null,null,null,null,null,"-",null,null,"Nijs","Latt","",""]
[{"$f":"'7e klasse'!A59","v":"Brink 6"},{"$f":"'7e klasse'!B59","v":"-"},{"$f":"'7e klasse'!C59","v":"Hertme 11"},0,"-",4,null,null,null,null,null,"-",null,null,"Brin","Hert","",""]
[]
[]
[]
[]
[]
[null,null,"Thuis",null,null,null,null,"Uit",null,"Totaal"]
["Brink",null,{"$f":"COUNTIF($O$4:$O$30,LEFT(A36,4))+COUNTIF($Q$4:$Q$30,LEFT(A36,4))","v":2},null,null,null,null,{"$f":"COUNTIF($P$4:$P$30,LEFT(A36,4))+COUNTIF($R$4:$R$30,LEFT(A36,4))","v":2},null,{"$f":"C36+H36","v":4}]
["Gunne",null,2,null,null,null,null,4,null,{"$f":"C37+H37","v":6}]
["H.K.V.",null,1,null,null,null,null,0,null,1]
["Hertme",null,4,null,null,null,null,5,null,9]
["Lattr. Brekl.",null,4,null,null,null,null,3,null,7]
["Nijstad",null,2,null,null,null,null,2,null,4,null,null,null,"Opgave"]
["O.Ootmarsum",null,3,null,null,null,null,4,null,7,null,null,null,4]
["Soasel",null,4,null,null,null,null,4,null,8,null,null,null,9]
["Vijfsprong",null,0,null,null,null,null,0,null,0,null,null,null,10]
["Wilskracht",null,2,null,null,null,null,1,null,3,null,null,null,7]
[null,null,null,null,null,null,null,null,null,null,null,null,null,1]
[null,null,{"$f":"SUM(C36:C46)","v":24},null,null,null,null,{"$f":"SUM(H36:H46)","v":25},null,{"$f":"SUM(J36:J46)","v":49},null,null,null,1]
[null,null,null,null,null,null,null,null,null,null,null,null,null,12]
[null,null,null,null,null,null,null,null,null,null,null,null,null,4]
[null,null,null,null,null,null,null,null,null,null,null,null,null,3]
[null,null,null,null,null,null,null,null,null,null,null,null,null,6]
[]
[null,null,null,null,null,null,null,null,null,null,null,null,null,{"$f":"SUM(N42:N52)","v":57}]

{"sheet":"wedstr. 9","index":10,"n_rows":47,"n_cols":18,"rows_kept":47,"cut":false,"hidden":false,"merged":[]}
["9e Speeldag",null,"Start",null,null,null,null,"senioren"]
[]
[]
["1e Klasse",null,null,null,null,null,null,"2e Klasse",null,null,null,null,null,null,{"$f":"LEFT(A4,4)","v":"1e K"},{"$f":"LEFT(C4,4)","v":""},{"$f":"LEFT(H4,4)","v":"2e K"},{"$f":"LEFT(J4,4)","v":""}]
[null,null,null,null,null,null,null,null,null,null,null,null,null,null,{"$f":"LEFT(A5,4)","v":""},{"$f":"LEFT(C5,4)","v":""},{"$f":"LEFT(H5,4)","v":""},{"$f":"LEFT(J5,4)","v":""}]
[{"$f":"'1e klasse'!H22","v":"Gunne 2"},{"$f":"'1e klasse'!I22","v":"-"},{"$f":"'1e klasse'!J22","v":"Gunne 1"},0,"-",4,null,{"$f":"'2e klasse'!H22","v":"Wilskracht 3"},{"$f":"'2e klasse'!I22","v":"-"},{"$f":"'2e klasse'!J22","v":"Gunne 3"},2,"-",2,null,"Gunn","Gunn","Wils","Gunn"]
[{"$f":"'1e klasse'!H23","v":"O.Ootmarsum 6"},{"$f":"'1e klasse'!I23","v":"-"},{"$f":"'1e klasse'!J23","v":"O.Ootmarsum 5"},3,"-",1,null,{"$f":"'2e klasse'!H23","v":"Soasel 3"},{"$f":"'2e klasse'!I23","v":"-"},{"$f":"'2e klasse'!J23","v":"Soasel 4"},4,"-",0,null,"O.Oo","O.Oo","Soas","Soas"]
[{"$f":"'1e klasse'!H24","v":"Hertme 4"},{"$f":"'1e klasse'!I24","v":"-"},{"$f":"'1e klasse'!J24","v":"Lattr. Brekl. 4"},2,"-",2,null,{"$f":"'2e klasse'!H24","v":"Hertme 5"},{"$f":"'2e klasse'!I24","v":"-"},{"$f":"'2e klasse'!J24","v":"Hertme 6"},0,"-",4,null,"Hert","Latt","Hert","Hert"]
[{"$f":"'1e klasse'!H25","v":"Soasel 2"},{"$f":"'1e klasse'!I25","v":"-"},{"$f":"'1e klasse'!J25","v":"Soasel 1"},0,"-",4,null,{"$f":"'2e klasse'!H25","v":"Brink 4"},{"$f":"'2e klasse'!I25","v":"-"},{"$f":"'2e klasse'!J25","v":"Brink 3"},2,"-",2,null,"Soas","Soas","Brin","Brin"]
[null,null,null,null,null,null,null,null,null,null,null,null,null,null,"","","",""]
["3e klasse",null,null,null,null,null,null,"4e klasse",null,null,null,null,null,null,"3e k","","4e k",""]
[null,null,null,null,null,null,null,null,null,null,null,null,null,null,"","","",""]
[{"$f":"'3e klasse'!H22","v":"Gunne 4"},{"$f":"'3e klasse'!I22","v":"-"},{"$f":"'3e klasse'!J22","v":"vrij"},null,"-",null,null,{"$f":"'4e klasse'!H22","v":"Lattr. Brekl. 6"},{"$f":"'4e klasse'!I22","v":"-"},{"$f":"'4e klasse'!J22","v":"Lattr. Brekl. 7"},2,"-",2,null,"Gunn","vrij","Latt","Latt"]
[{"$f":"'3e klasse'!H23","v":"Nijstad 3"},{"$f":"'3e klasse'!I23","v":"-"},{"$f":"'3e klasse'!J23","v":"Nijstad 2"},2,"-",2,null,{"$f":"'4e klasse'!H23","v":"O.Ootmarsum 8"},{"$f":"'4e klasse'!I23","v":"-"},{"$f":"'4e klasse'!J23","v":"O.Ootmarsum 7"},4,"-",0,null,"Nijs","Nijs","O.Oo","O.Oo"]
[{"$f":"'3e klasse'!H24","v":"Lattr. Brekl. 5"},{"$f":"'3e klasse'!I24","v":"-"},{"$f":"'3e klasse'!J24","v":"H.K.V. 1"},4,"-",0,null,{"$f":"'4e klasse'!H24","v":"Hertme 8"},{"$f":"'4e klasse'!I24","v":"-"},{"$f":"'4e klasse'!J24","v":"Hertme 7"},4,"-",0,null,"Latt","H.K.","Hert","Hert"]
[{"$f":"'3e klasse'!H25","v":"Soasel 5"},{"$f":"'3e klasse'!I25","v":"-"},{"$f":"'3e klasse'!J25","v":"Wilskracht 4"},2,"-",2,null,{"$f":"'4e klasse'!H25","v":"vrij"},{"$f":"'4e klasse'!I25","v":"-"},{"$f":"'4e klasse'!J25","v":"Soasel 6"},null,"-",null,null,"Soas","Wils","vrij","Soas"]
[null,null,null,null,null,null,null,null,null,null,null,null,null,null,"","","",""]
["5e klasse",null,null,null,null,null,null,"6e klasse",null,null,null,null,null,null,"5e k","","6e k",""]
[null,null,null,null,null,null,null,null,null,null,null,null,null,null,"","","",""]
[{"$f":"'5e klasse'!H22","v":"Gunne 5"},{"$f":"'5e klasse'!I22","v":"-"},{"$f":"'5e klasse'!J22","v":"vrij"},null,"-",null,null,{"$f":"'6e klasse'!H15","v":"Hertme 10"},{"$f":"'6e klasse'!I15","v":"-"},{"$f":"'6e klasse'!J15","v":"Brink 5"},0,"-",4,null,"Gunn","vrij","Hert","Brin"]
[{"$f":"'5e klasse'!H23","v":"O.Ootmarsum 9"},{"$f":"'5e klasse'!I23","v":"-"},{"$f":"'5e klasse'!J23","v":"O.Ootmarsum 10"},4,"-",0,null,{"$f":"'6e klasse'!H16","v":"Lattr. Brekl. 9"},{"$f":"'6e klasse'!I16","v":"-"},{"$f":"'6e klasse'!J16","v":"Wilskracht 5"},3,"-",1,null,"O.Oo","O.Oo","Latt","Wils"]
[{"$f":"'5e klasse'!H24","v":"Nijstad 4"},{"$f":"'5e klasse'!I24","v":"-"},{"$f":"'5e klasse'!J24","v":"Hertme 9"},3,"-",1,null,{"$f":"'6e klasse'!H17","v":"O.Ootmarsum 11"},{"$f":"'6e klasse'!I17","v":"-"},{"$f":"'6e klasse'!J17","v":"Soasel 8"},1,"-",3,null,"Nijs","Hert","O.Oo","Soas"]
[{"$f":"'5e klasse'!H25","v":"Soasel 7"},{"$f":"'5e klasse'!I25","v":"-"},{"$f":"'5e klasse'!J25","v":"Lattr. Brekl. 8"},3,"-",1,null,{"$f":"'6e klasse'!H18","v":" "},{"$f":"'6e klasse'!I18","v":" "},{"$f":"'6e klasse'!J18","v":" "},null,"-",null,null,"Soas","Latt"," "," "]
[null,null,null,null,null,null,null,null,null,null,null,null,null,null,"","","",""]
["7e klasse",null,null,null,null,null,null,null,null,null,null,null,null,null,"7e k","","",""]
[null,null,null,null,null,null,null,null,null,null,null,null,null,null,"","","",""]
[{"$f":"'7e klasse'!H15","v":"Gunne 6"},{"$f":"'7e klasse'!I15","v":"-"},{"$f":"'7e klasse'!J15","v":"Lattr. Brekl. 10"},0,"-",4,null,null,null,null,null,"-",null,null,"Gunn","Latt","",""]
[{"$f":"'7e klasse'!H16","v":"Brink 6"},{"$f":"'7e klasse'!I16","v":"-"},{"$f":"'7e klasse'!J16","v":"Hertme 12"},3,"-",1,null,null,null,null,null,"-",null,null,"Brin","Hert","",""]
[{"$f":"'7e klasse'!H17","v":"Hertme 11"},{"$f":"'7e klasse'!I17","v":"-"},{"$f":"'7e klasse'!J17","v":"Nijstad 5"},4,"-",0,null,null,null,null,null,"-",null,null,"Hert","Nijs","",""]
[{"$f":"'7e klasse'!H18","v":" "},{"$f":"'7e klasse'!I18","v":" "},{"$f":"'7e klasse'!J18","v":" "},null,"-",null,null,{"$f":"'6e klasse'!H18","v":" "},{"$f":"'6e klasse'!I18","v":" "},{"$f":"'6e klasse'!J18","v":" "},null,"-",null,null," "," "," "," "]
[]
[]
[]
[]
[null,null,"Thuis",null,null,null,null,"Uit",null,"Totaal",null,null,null,"Opgave"]
["Brink",null,{"$f":"COUNTIF($O$4:$O$30,LEFT(A36,4))+COUNTIF($Q$4:$Q$30,LEFT(A36,4))","v":2},null,null,null,null,{"$f":"COUNTIF($P$4:$P$30,LEFT(A36,4))+COUNTIF($R$4:$R$30,LEFT(A36,4))","v":2},null,{"$f":"C36+H36","v":4},null,null,null,7]
["Gunne",null,4,null,null,null,null,2,null,{"$f":"C37+H37","v":6},null,null,null,8]
["H.K.V.",null,0,null,null,null,null,1,null,1,null,null,null,4]
["Hertme",null,5,null,null,null,null,4,null,9,null,null,null,9]
["Lattr. Brekl.",null,3,null,null,null,null,4,null,7,null,null,null,10]
["Nijstad",null,2,null,null,null,null,2,null,4,null,null,null,7]
["O.Ootmarsum",null,4,null,null,null,null,3,null,7,null,null,null,12]
["Soasel",null,4,null,null,null,null,4,null,8,null,null,null,4]
["Vijfsprong",null,0,null,null,null,null,0,null,0,null,null,null,3]
["Wilskracht",null,1,null,null,null,null,2,null,3,null,null,null,6]
[]
[null,null,{"$f":"SUM(C36:C46)","v":25},null,null,null,null,{"$f":"SUM(H36:H46)","v":24},null,{"$f":"SUM(J36:J46)","v":49},null,null,null,{"$f":"SUM(N36:N46)","v":70}]

{"sheet":"wedstr. 10","index":11,"n_rows":47,"n_cols":18,"rows_kept":47,"cut":false,"hidden":false,"merged":[]}
["10e Speeldag",null,"Start",null,null,null,null,"senioren"]
[]
[]
["1e Klasse",null,null,null,null,null,null,"2e Klasse",null,null,null,null,null,null,{"$f":"LEFT(A4,4)","v":"1e K"},{"$f":"LEFT(C4,4)","v":""},{"$f":"LEFT(H4,4)","v":"2e K"},{"$f":"LEFT(J4,4)","v":""}]
[null,null,null,null,null,null,null,null,null,null,null,null,null,null,{"$f":"LEFT(A5,4)","v":""},{"$f":"LEFT(C5,4)","v":""},{"$f":"LEFT(H5,4)","v":""},{"$f":"LEFT(J5,4)","v":""}]
[{"$f":"'1e klasse'!H30","v":"O.Ootmarsum 5"},{"$f":"'1e klasse'!I30","v":"-"},{"$f":"'1e klasse'!J30","v":"Soasel 2"},3,"-",1,null,{"$f":"'2e klasse'!H30","v":"Soasel 4"},{"$f":"'2e klasse'!I30","v":"-"},{"$f":"'2e klasse'!J30","v":"Brink 4"},0,"-",4,null,"O.Oo","Soas","Soas","Brin"]
[{"$f":"'1e klasse'!H31","v":"Lattr. Brekl. 4"},{"$f":"'1e klasse'!I31","v":"-"},{"$f":"'1e klasse'!J31","v":"Gunne 2"},2,"-",2,null,{"$f":"'2e klasse'!H31","v":"Hertme 6"},{"$f":"'2e klasse'!I31","v":"-"},{"$f":"'2e klasse'!J31","v":"Wilskracht 3"},2,"-",2,null,"Latt","Gunn","Hert","Wils"]
[{"$f":"'1e klasse'!H32","v":"Soasel 1"},{"$f":"'1e klasse'!I32","v":"-"},{"$f":"'1e klasse'!J32","v":"O.Ootmarsum 6"},4,"-",0,null,{"$f":"'2e klasse'!H32","v":"Brink 3"},{"$f":"'2e klasse'!I32","v":"-"},{"$f":"'2e klasse'!J32","v":"Soasel 3"},3,"-",1,null,"Soas","O.Oo","Brin","Soas"]
[{"$f":"'1e klasse'!H33","v":"Gunne 1"},{"$f":"'1e klasse'!I33","v":"-"},{"$f":"'1e klasse'!J33","v":"Hertme 4"},4,"-",0,null,{"$f":"'2e klasse'!H33","v":"Gunne 3"},{"$f":"'2e klasse'!I33","v":"-"},{"$f":"'2e klasse'!J33","v":"Hertme 5"},4,"-",0,null,"Gunn","Hert","Gunn","Hert"]
[null,null,null,null,null,null,null,null,null,null,null,null,null,null,"","","",""]
["3e klasse",null,null,null,null,null,null,"4e klasse",null,null,null,null,null,null,"3e k","","4e k",""]
[null,null,null,null,null,null,null,null,null,null,null,null,null,null,"","","",""]
[{"$f":"'3e klasse'!H30","v":"Nijstad 2"},{"$f":"'3e klasse'!I30","v":"-"},{"$f":"'3e klasse'!J30","v":"Soasel 5"},4,"-",0,null,{"$f":"'4e klasse'!H30","v":"O.Ootmarsum 7"},{"$f":"'4e klasse'!I30","v":"-"},{"$f":"'4e klasse'!J30","v":"vrij"},null,"-",null,null,"Nijs","Soas","O.Oo","vrij"]
[{"$f":"'3e klasse'!H31","v":"H.K.V. 1"},{"$f":"'3e klasse'!I31","v":"-"},{"$f":"'3e klasse'!J31","v":"Gunne 4"},2,"-",2,null,{"$f":"'4e klasse'!H31","v":"Hertme 7"},{"$f":"'4e klasse'!I31","v":"-"},{"$f":"'4e klasse'!J31","v":"Lattr. Brekl. 6"},0,"-",4,null,"H.K.","Gunn","Hert","Latt"]
[{"$f":"'3e klasse'!H32","v":"Wilskracht 4"},{"$f":"'3e klasse'!I32","v":"-"},{"$f":"'3e klasse'!J32","v":"Nijstad 3"},4,"-",0,null,{"$f":"'4e klasse'!H32","v":"Soasel 6"},{"$f":"'4e klasse'!I32","v":"-"},{"$f":"'4e klasse'!J32","v":"O.Ootmarsum 8"},0,"-",4,null,"Wils","Nijs","Soas","O.Oo"]
[{"$f":"'3e klasse'!H33","v":"vrij"},{"$f":"'3e klasse'!I33","v":"-"},{"$f":"'3e klasse'!J33","v":"Lattr. Brekl. 5"},null,"-",null,null,{"$f":"'4e klasse'!H33","v":"Lattr. Brekl. 7"},{"$f":"'4e klasse'!I33","v":"-"},{"$f":"'4e klasse'!J33","v":"Hertme 8"},2,"-",2,null,"vrij","Latt","Latt","Hert"]
[null,null,null,null,null,null,null,null,null,null,null,null,null,null,"","","",""]
["5e klasse",null,null,null,null,null,null,"6e klasse",null,null,null,null,null,null,"5e k","","6e k",""]
[null,null,null,null,null,null,null,null,null,null,null,null,null,null,"","","",""]
[{"$f":"'5e klasse'!H30","v":"O.Ootmarsum 10"},{"$f":"'5e klasse'!I30","v":"-"},{"$f":"'5e klasse'!J30","v":"Soasel 7"},3,"-",1,null,{"$f":"'6e klasse'!H21","v":"Brink 5"},{"$f":"'6e klasse'!I21","v":"-"},{"$f":"'6e klasse'!J21","v":"Wilskracht 5"},4,"-",0,null,"O.Oo","Soas","Brin","Wils"]
[{"$f":"'5e klasse'!H31","v":"Hertme 9"},{"$f":"'5e klasse'!I31","v":"-"},{"$f":"'5e klasse'!J31","v":"Gunne 5"},2,"-",2,null,{"$f":"'6e klasse'!H22","v":"O.Ootmarsum 11"},{"$f":"'6e klasse'!I22","v":"-"},{"$f":"'6e klasse'!J22","v":"Hertme 10"},1,"-",3,null,"Hert","Gunn","O.Oo","Hert"]
[{"$f":"'5e klasse'!H32","v":"Lattr. Brekl. 8"},{"$f":"'5e klasse'!I32","v":"-"},{"$f":"'5e klasse'!J32","v":"O.Ootmarsum 9"},0,"-",4,null,{"$f":"'6e klasse'!H23","v":"Soasel 8"},{"$f":"'6e klasse'!I23","v":"-"},{"$f":"'6e klasse'!J23","v":"Lattr. Brekl. 9"},2,"-",2,null,"Latt","O.Oo","Soas","Latt"]
[{"$f":"'5e klasse'!H33","v":"vrij"},{"$f":"'5e klasse'!I33","v":"-"},{"$f":"'5e klasse'!J33","v":"Nijstad 4"},null,"-",null,null,{"$f":"'6e klasse'!H24","v":" "},{"$f":"'6e klasse'!I24","v":" "},{"$f":"'6e klasse'!J24","v":" "},null,"-",null,null,"vrij","Nijs"," "," "]
[null,null,null,null,null,null,null,null,null,null,null,null,null,null,"","","",""]
["7e klasse",null,null,null,null,null,null,null,null,null,null,null,null,null,"7e k","","",""]
[null,null,null,null,null,null,null,null,null,null,null,null,null,null,"","","",""]
[{"$f":"'7e klasse'!H21","v":"Lattr. Brekl. 10"},{"$f":"'7e klasse'!I21","v":"-"},{"$f":"'7e klasse'!J21","v":"Hertme 12"},4,"-",0,null,null,null,null,null,"-",null,null,"Latt","Hert","",""]
[{"$f":"'7e klasse'!H22","v":"Hertme 11"},{"$f":"'7e klasse'!I22","v":"-"},{"$f":"'7e klasse'!J22","v":"Gunne 6"},4,"-",0,null,null,null,null,null,"-",null,null,"Hert","Gunn","",""]
[{"$f":"'7e klasse'!H23","v":"Nijstad 5"},{"$f":"'7e klasse'!I23","v":"-"},{"$f":"'7e klasse'!J23","v":"Brink 6"},3,"-",1,null,null,null,null,null,"-",null,null,"Nijs","Brin","",""]
[null,null,null,null,null,null,null,{"$f":"'6e klasse'!H24","v":" "},{"$f":"'6e klasse'!I24","v":" "},{"$f":"'6e klasse'!J24","v":" "},null,null,null,null,"",""," "," "]
[]
[]
[]
[]
[null,null,"Thuis",null,null,null,null,"Uit",null,"Totaal",null,null,null,"Opgave"]
["Brink",null,{"$f":"COUNTIF($O$4:$O$30,LEFT(A36,4))+COUNTIF($Q$4:$Q$30,LEFT(A36,4))","v":2},null,null,null,null,{"$f":"COUNTIF($P$4:$P$30,LEFT(A36,4))+COUNTIF($R$4:$R$30,LEFT(A36,4))","v":2},null,{"$f":"C36+H36","v":4},null,null,null,7]
["Gunne",null,2,null,null,null,null,4,null,{"$f":"C37+H37","v":6},null,null,null,8]
["H.K.V.",null,1,null,null,null,null,0,null,1,null,null,null,4]
["Hertme",null,4,null,null,null,null,5,null,9,null,null,null,9]
["Lattr. Brekl.",null,4,null,null,null,null,3,null,7,null,null,null,10]
["Nijstad",null,2,null,null,null,null,2,null,4,null,null,null,7]
["O.Ootmarsum",null,4,null,null,null,null,3,null,7,null,null,null,12]
["Soasel",null,4,null,null,null,null,4,null,8,null,null,null,4]
["Vijfsprong",null,0,null,null,null,null,0,null,0,null,null,null,3]
["Wilskracht",null,1,null,null,null,null,2,null,3,null,null,null,6]
[]
[null,null,{"$f":"SUM(C36:C46)","v":24},null,null,null,null,{"$f":"SUM(H36:H46)","v":25},null,{"$f":"SUM(J36:J46)","v":49},null,null,null,{"$f":"SUM(N36:N46)","v":70}]

{"sheet":"wedstr. 11","index":12,"n_rows":47,"n_cols":18,"rows_kept":47,"cut":false,"hidden":false,"merged":[]}
["11e Speeldag",null,"Start",null,null,null,null,"senioren"]
[]
[]
["1e Klasse",null,null,null,null,null,null,"2e Klasse",null,null,null,null,null,null,{"$f":"LEFT(A4,4)","v":"1e K"},{"$f":"LEFT(C4,4)","v":""},{"$f":"LEFT(H4,4)","v":"2e K"},{"$f":"LEFT(J4,4)","v":""}]
[null,null,null,null,null,null,null,null,null,null,null,null,null,null,{"$f":"LEFT(A5,4)","v":""},{"$f":"LEFT(C5,4)","v":""},{"$f":"LEFT(H5,4)","v":""},{"$f":"LEFT(J5,4)","v":""}]
[{"$f":"'1e klasse'!H38","v":"O.Ootmarsum 6"},{"$f":"'1e klasse'!I38","v":"-"},{"$f":"'1e klasse'!J38","v":"Gunne 1"},0,"-",4,null,{"$f":"'2e klasse'!H38","v":"Soasel 3"},{"$f":"'2e klasse'!I38","v":"-"},{"$f":"'2e klasse'!J38","v":"Gunne 3"},4,"-",0,null,"O.Oo","Gunn","Soas","Gunn"]
[{"$f":"'1e klasse'!H39","v":"Hertme 4"},{"$f":"'1e klasse'!I39","v":"-"},{"$f":"'1e klasse'!J39","v":"O.Ootmarsum 5"},0,"-",4,null,{"$f":"'2e klasse'!H39","v":"Hertme 5"},{"$f":"'2e klasse'!I39","v":"-"},{"$f":"'2e klasse'!J39","v":"Soasel 4"},1,"-",3,null,"Hert","O.Oo","Hert","Soas"]
[{"$f":"'1e klasse'!H40","v":"Soasel 2"},{"$f":"'1e klasse'!I40","v":"-"},{"$f":"'1e klasse'!J40","v":"Lattr. Brekl. 4"},2,"-",2,null,{"$f":"'2e klasse'!H40","v":"Brink 4"},{"$f":"'2e klasse'!I40","v":"-"},{"$f":"'2e klasse'!J40","v":"Hertme 6"},2,"-",2,null,"Soas","Latt","Brin","Hert"]
[{"$f":"'1e klasse'!H41","v":"Gunne 2"},{"$f":"'1e klasse'!I41","v":"-"},{"$f":"'1e klasse'!J41","v":"Soasel 1"},0,"-",4,null,{"$f":"'2e klasse'!H41","v":"Wilskracht 3"},{"$f":"'2e klasse'!I41","v":"-"},{"$f":"'2e klasse'!J41","v":"Brink 3"},1,"-",3,null,"Gunn","Soas","Wils","Brin"]
[null,null,null,null,null,null,null,null,null,null,null,null,null,null,"","","",""]
["3e klasse",null,null,null,null,null,null,"4e klasse",null,null,null,null,null,null,"3e k","","4e k",""]
[null,null,null,null,null,null,null,null,null,null,null,null,null,null,"","","",""]
[{"$f":"'3e klasse'!H38","v":"Nijstad 3"},{"$f":"'3e klasse'!I38","v":"-"},{"$f":"'3e klasse'!J38","v":"vrij"},null,"-",null,null,{"$f":"'4e klasse'!H38","v":"O.Ootmarsum 8"},{"$f":"'4e klasse'!I38","v":"-"},{"$f":"'4e klasse'!J38","v":"Lattr. Brekl. 7"},3,"-",1,null,"Nijs","vrij","O.Oo","Latt"]
[{"$f":"'3e klasse'!H39","v":"Lattr. Brekl. 5"},{"$f":"'3e klasse'!I39","v":"-"},{"$f":"'3e klasse'!J39","v":"Nijstad 2"},4,"-",0,null,{"$f":"'4e klasse'!H39","v":"Hertme 8"},{"$f":"'4e klasse'!I39","v":"-"},{"$f":"'4e klasse'!J39","v":"O.Ootmarsum 7"},1,"-",3,null,"Latt","Nijs","Hert","O.Oo"]
[{"$f":"'3e klasse'!H40","v":"Soasel 5"},{"$f":"'3e klasse'!I40","v":"-"},{"$f":"'3e klasse'!J40","v":"H.K.V. 1"},2,"-",2,null,{"$f":"'4e klasse'!H40","v":"vrij"},{"$f":"'4e klasse'!I40","v":"-"},{"$f":"'4e klasse'!J40","v":"Hertme 7"},null,"-",null,null,"Soas","H.K.","vrij","Hert"]
[{"$f":"'3e klasse'!H41","v":"Gunne 4"},{"$f":"'3e klasse'!I41","v":"-"},{"$f":"'3e klasse'!J41","v":"Wilskracht 4"},2,"-",2,null,{"$f":"'4e klasse'!H41","v":"Lattr. Brekl. 6"},{"$f":"'4e klasse'!I41","v":"-"},{"$f":"'4e klasse'!J41","v":"Soasel 6"},1,"-",3,null,"Gunn","Wils","Latt","Soas"]
[null,null,null,null,null,null,null,null,null,null,null,null,null,null,"","","",""]
["5e klasse",null,null,null,null,null,null,"6e klasse",null,null,null,null,null,null,"5e k","","6e k",""]
[null,null,null,null,null,null,null,null,null,null,null,null,null,null,"","","",""]
[{"$f":"'5e klasse'!H38","v":"O.Ootmarsum 9"},{"$f":"'5e klasse'!I38","v":"-"},{"$f":"'5e klasse'!J38","v":"vrij"},null,"-",null,null,{"$f":"'6e klasse'!H27","v":"Hertme 10"},{"$f":"'6e klasse'!I27","v":"-"},{"$f":"'6e klasse'!J27","v":"Lattr. Brekl. 9"},2,"-",2,null,"O.Oo","vrij","Hert","Latt"]
[{"$f":"'5e klasse'!H39","v":"Nijstad 4"},{"$f":"'5e klasse'!I39","v":"-"},{"$f":"'5e klasse'!J39","v":"O.Ootmarsum 10"},2,"-",2,null,{"$f":"'6e klasse'!H28","v":"Wilskracht 5"},{"$f":"'6e klasse'!I28","v":"-"},{"$f":"'6e klasse'!J28","v":"Soasel 8"},2,"-",2,null,"Nijs","O.Oo","Wils","Soas"]
[{"$f":"'5e klasse'!H40","v":"Soasel 7"},{"$f":"'5e klasse'!I40","v":"-"},{"$f":"'5e klasse'!J40","v":"Hertme 9"},2,"-",2,null,{"$f":"'6e klasse'!H29","v":"Brink 5"},{"$f":"'6e klasse'!I29","v":"-"},{"$f":"'6e klasse'!J29","v":"O.Ootmarsum 11"},4,"-",0,null,"Soas","Hert","Brin","O.Oo"]
[{"$f":"'5e klasse'!H41","v":"Gunne 5"},{"$f":"'5e klasse'!I41","v":"-"},{"$f":"'5e klasse'!J41","v":"Lattr. Brekl. 8"},1,"-",3,null,null,null,null,null,"-",null,null,"Gunn","Latt","",""]
[null,null,null,null,null,null,null,null,null,null,null,null,null,null,"","","",""]
["7e klasse",null,null,null,null,null,null,null,null,null,null,null,null,null,"7e k","","",""]
[null,null,null,null,null,null,null,null,null,null,null,null,null,null,"","","",""]
[{"$f":"'7e klasse'!H27","v":"Gunne 6"},{"$f":"'7e klasse'!I27","v":"-"},{"$f":"'7e klasse'!J27","v":"Brink 6"},1,"-",3,null,null,null,null,null,"-",null,null,"Gunn","Brin","",""]
[{"$f":"'7e klasse'!H28","v":"Hertme 12"},{"$f":"'7e klasse'!I28","v":"-"},{"$f":"'7e klasse'!J28","v":"Nijstad 5"},1,"-",3,null,null,null,null,null,"-",null,null,"Hert","Nijs","",""]
[{"$f":"'7e klasse'!H29","v":"Lattr. Brekl. 10"},{"$f":"'7e klasse'!I29","v":"-"},{"$f":"'7e klasse'!J29","v":"Hertme 11"},0,"-",4,null,null,null,null,null,"-",null,null,"Latt","Hert","",""]
[]
[]
[]
[]
[]
[null,null,"Thuis",null,null,null,null,"Uit",null,"Totaal",null,null,null,"Opgave"]
["Brink",null,{"$f":"COUNTIF($O$4:$O$30,LEFT(A36,4))+COUNTIF($Q$4:$Q$30,LEFT(A36,4))","v":2},null,null,null,null,{"$f":"COUNTIF($P$4:$P$30,LEFT(A36,4))+COUNTIF($R$4:$R$30,LEFT(A36,4))","v":2},null,{"$f":"C36+H36","v":4},null,null,null,7]
["Gunne",null,4,null,null,null,null,2,null,{"$f":"C37+H37","v":6},null,null,null,8]
["H.K.V.",null,0,null,null,null,null,1,null,1,null,null,null,4]
["Hertme",null,5,null,null,null,null,4,null,9,null,null,null,9]
["Lattr. Brekl.",null,3,null,null,null,null,4,null,7,null,null,null,10]
["Nijstad",null,2,null,null,null,null,2,null,4,null,null,null,7]
["O.Ootmarsum",null,3,null,null,null,null,4,null,7,null,null,null,12]
["Soasel",null,4,null,null,null,null,4,null,8,null,null,null,4]
["Vijfsprong",null,0,null,null,null,null,0,null,0,null,null,null,3]
["Wilskracht",null,2,null,null,null,null,1,null,3,null,null,null,6]
[]
[null,null,{"$f":"SUM(C36:C46)","v":25},null,null,null,null,{"$f":"SUM(H36:H46)","v":24},null,{"$f":"SUM(J36:J46)","v":49},null,null,null,{"$f":"SUM(N36:N46)","v":70}]

{"sheet":"wedstr. 12","index":13,"n_rows":47,"n_cols":18,"rows_kept":47,"cut":false,"hidden":false,"merged":[]}
["12e Speeldag",null,"Start",null,null,null,null,"senioren"]
[]
[]
["1e Klasse",null,null,null,null,null,null,"2e Klasse",null,null,null,null,null,null,{"$f":"LEFT(A4,4)","v":"1e K"},{"$f":"LEFT(C4,4)","v":""},{"$f":"LEFT(H4,4)","v":"2e K"},{"$f":"LEFT(J4,4)","v":""}]
[null,null,null,null,null,null,null,null,null,null,null,null,null,null,{"$f":"LEFT(A5,4)","v":""},{"$f":"LEFT(C5,4)","v":""},{"$f":"LEFT(H5,4)","v":""},{"$f":"LEFT(J5,4)","v":""}]
[{"$f":"'1e klasse'!H46","v":"Gunne 2"},{"$f":"'1e klasse'!I46","v":"-"},{"$f":"'1e klasse'!J46","v":"Soasel 2"},1,"-",3,null,{"$f":"'2e klasse'!H46","v":"Wilskracht 3"},{"$f":"'2e klasse'!I46","v":"-"},{"$f":"'2e klasse'!J46","v":"Brink 4"},0,"-",4,null,"Gunn","Soas","Wils","Brin"]
[{"$f":"'1e klasse'!H47","v":"O.Ootmarsum 5"},{"$f":"'1e klasse'!I47","v":"-"},{"$f":"'1e klasse'!J47","v":"Gunne 1"},0,"-",4,null,{"$f":"'2e klasse'!H47","v":"Soasel 4"},{"$f":"'2e klasse'!I47","v":"-"},{"$f":"'2e klasse'!J47","v":"Gunne 3"},2,"-",2,null,"O.Oo","Gunn","Soas","Gunn"]
[{"$f":"'1e klasse'!H48","v":"Hertme 4"},{"$f":"'1e klasse'!I48","v":"-"},{"$f":"'1e klasse'!J48","v":"O.Ootmarsum 6"},3,"-",1,null,{"$f":"'2e klasse'!H48","v":"Hertme 5"},{"$f":"'2e klasse'!I48","v":"-"},{"$f":"'2e klasse'!J48","v":"Soasel 3"},0,"-",4,null,"Hert","O.Oo","Hert","Soas"]
[{"$f":"'1e klasse'!H49","v":"Soasel 1"},{"$f":"'1e klasse'!I49","v":"-"},{"$f":"'1e klasse'!J49","v":"Lattr. Brekl. 4"},4,"-",0,null,{"$f":"'2e klasse'!H49","v":"Brink 3"},{"$f":"'2e klasse'!I49","v":"-"},{"$f":"'2e klasse'!J49","v":"Hertme 6"},4,"-",0,null,"Soas","Latt","Brin","Hert"]
[null,null,null,null,null,null,null,null,null,null,null,null,null,null,"","","",""]
["3e klasse",null,null,null,null,null,null,"4e klasse",null,null,null,null,null,null,"3e k","","4e k",""]
[null,null,null,null,null,null,null,null,null,null,null,null,null,null,"","","",""]
[{"$f":"'3e klasse'!H46","v":"Gunne 4"},{"$f":"'3e klasse'!I46","v":"-"},{"$f":"'3e klasse'!J46","v":"Soasel 5"},2,"-",2,null,{"$f":"'4e klasse'!H46","v":"Lattr. Brekl. 6"},{"$f":"'4e klasse'!I46","v":"-"},{"$f":"'4e klasse'!J46","v":"vrij"},null,"-",null,null,"Gunn","Soas","Latt","vrij"]
[{"$f":"'3e klasse'!H47","v":"Nijstad 2"},{"$f":"'3e klasse'!I47","v":"-"},{"$f":"'3e klasse'!J47","v":"vrij"},null,"-",null,null,{"$f":"'4e klasse'!H47","v":"O.Ootmarsum 7"},{"$f":"'4e klasse'!I47","v":"-"},{"$f":"'4e klasse'!J47","v":"Lattr. Brekl. 7"},4,"-",0,null,"Nijs","vrij","O.Oo","Latt"]
[{"$f":"'3e klasse'!H48","v":"Lattr. Brekl. 5"},{"$f":"'3e klasse'!I48","v":"-"},{"$f":"'3e klasse'!J48","v":"Nijstad 3"},3,"-",1,null,{"$f":"'4e klasse'!H48","v":"Hertme 8"},{"$f":"'4e klasse'!I48","v":"-"},{"$f":"'4e klasse'!J48","v":"O.Ootmarsum 8"},0,"-",4,null,"Latt","Nijs","Hert","O.Oo"]
[{"$f":"'3e klasse'!H49","v":"Wilskracht 4"},{"$f":"'3e klasse'!I49","v":"-"},{"$f":"'3e klasse'!J49","v":"H.K.V. 1"},4,"-",0,null,{"$f":"'4e klasse'!H49","v":"Soasel 6"},{"$f":"'4e klasse'!I49","v":"-"},{"$f":"'4e klasse'!J49","v":"Hertme 7"},4,"-",0,null,"Wils","H.K.","Soas","Hert"]
[null,null,null,null,null,null,null,null,null,null,null,null,null,null,"","","",""]
["5e klasse",null,null,null,null,null,null,"6e klasse",null,null,null,null,null,null,"5e k","","6e k",""]
[null,null,null,null,null,null,null,null,null,null,null,null,null,null,"","","",""]
[{"$f":"'5e klasse'!H46","v":"Gunne 5"},{"$f":"'5e klasse'!I46","v":"-"},{"$f":"'5e klasse'!J46","v":"Soasel 7"},2,"-",2,null,{"$f":"'6e klasse'!H33","v":"Soasel 8"},{"$f":"'6e klasse'!I33","v":"-"},{"$f":"'6e klasse'!J33","v":"Hertme 10"},1,"-",3,null,"Gunn","Soas","Soas","Hert"]
[{"$f":"'5e klasse'!H47","v":"O.Ootmarsum 10"},{"$f":"'5e klasse'!I47","v":"-"},{"$f":"'5e klasse'!J47","v":"vrij"},null,"-",null,null,{"$f":"'6e klasse'!H34","v":"O.Ootmarsum 11"},{"$f":"'6e klasse'!I34","v":"-"},{"$f":"'6e klasse'!J34","v":"Wilskracht 5"},1,"-",3,null,"O.Oo","vrij","O.Oo","Wils"]
[{"$f":"'5e klasse'!H48","v":"Nijstad 4"},{"$f":"'5e klasse'!I48","v":"-"},{"$f":"'5e klasse'!J48","v":"O.Ootmarsum 9"},2,"-",2,null,{"$f":"'6e klasse'!H35","v":"Lattr. Brekl. 9"},{"$f":"'6e klasse'!I35","v":"-"},{"$f":"'6e klasse'!J35","v":"Brink 5"},0,"-",4,null,"Nijs","O.Oo","Latt","Brin"]
[{"$f":"'5e klasse'!H49","v":"Lattr. Brekl. 8"},{"$f":"'5e klasse'!I49","v":"-"},{"$f":"'5e klasse'!J49","v":"Hertme 9"},1,"-",3,null,{"$f":"'6e klasse'!H36","v":" "},{"$f":"'6e klasse'!I36","v":" "},{"$f":"'6e klasse'!J36","v":" "},null,"-",null,null,"Latt","Hert"," "," "]
[null,null,null,null,null,null,null,null,null,null,null,null,null,null,"","","",""]
["7e klasse",null,null,null,null,null,null,null,null,null,null,null,null,null,"7e k","","",""]
[null,null,null,null,null,null,null,null,null,null,null,null,null,null,"","","",""]
[{"$f":"'7e klasse'!H33","v":"Nijstad 5"},{"$f":"'7e klasse'!I33","v":"-"},{"$f":"'7e klasse'!J33","v":"Gunne 6"},0,"-",4,null,null,null,null,null,"-",null,null,"Nijs","Gunn","",""]
[{"$f":"'7e klasse'!H34","v":"Hertme 11"},{"$f":"'7e klasse'!I34","v":"-"},{"$f":"'7e klasse'!J34","v":"Hertme 12"},2,"-",2,null,null,null,null,null,"-",null,null,"Hert","Hert","",""]
[{"$f":"'7e klasse'!H35","v":"Brink 6"},{"$f":"'7e klasse'!I35","v":"-"},{"$f":"'7e klasse'!J35","v":"Lattr. Brekl. 10"},1,"-",3,null,null,null,null,null,"-",null,null,"Brin","Latt","",""]
[{"$f":"'7e klasse'!H36","v":" "},{"$f":"'7e klasse'!I36","v":" "},{"$f":"'7e klasse'!J36","v":" "},null,"-",null,null,{"$f":"'6e klasse'!H36","v":" "},{"$f":"'6e klasse'!I36","v":" "},{"$f":"'6e klasse'!J36","v":" "},null,"-",null,null," "," "," "," "]
[]
[]
[]
[]
[null,null,"Thuis",null,null,null,null,"Uit",null,"Totaal",null,null,null,"Opgave"]
["Brink",null,{"$f":"COUNTIF($O$4:$O$30,LEFT(A36,4))+COUNTIF($Q$4:$Q$30,LEFT(A36,4))","v":2},null,null,null,null,{"$f":"COUNTIF($P$4:$P$30,LEFT(A36,4))+COUNTIF($R$4:$R$30,LEFT(A36,4))","v":2},null,{"$f":"C36+H36","v":4},null,null,null,7]
["Gunne",null,3,null,null,null,null,3,null,{"$f":"C37+H37","v":6},null,null,null,8]
["H.K.V.",null,0,null,null,null,null,1,null,1,null,null,null,4]
["Hertme",null,4,null,null,null,null,5,null,9,null,null,null,9]
["Lattr. Brekl.",null,4,null,null,null,null,3,null,7,null,null,null,10]
["Nijstad",null,3,null,null,null,null,1,null,4,null,null,null,7]
["O.Ootmarsum",null,4,null,null,null,null,3,null,7,null,null,null,12]
["Soasel",null,4,null,null,null,null,4,null,8,null,null,null,4]
["Vijfsprong",null,0,null,null,null,null,0,null,0,null,null,null,3]
["Wilskracht",null,2,null,null,null,null,1,null,3,null,null,null,6]
[]
[null,null,{"$f":"SUM(C36:C46)","v":26},null,null,null,null,{"$f":"SUM(H36:H46)","v":23},null,{"$f":"SUM(J36:J46)","v":49},null,null,null,{"$f":"SUM(N36:N46)","v":70}]

{"sheet":"wedstr. 13","index":14,"n_rows":47,"n_cols":18,"rows_kept":47,"cut":false,"hidden":false,"merged":[]}
["13e Speeldag",null,"Start",null,null,null,null,"senioren"]
[]
[]
["1e Klasse",null,null,null,null,null,null,"2e Klasse",null,null,null,null,null,null,{"$f":"LEFT(A4,4)","v":"1e K"},{"$f":"LEFT(C4,4)","v":""},{"$f":"LEFT(H4,4)","v":"2e K"},{"$f":"LEFT(J4,4)","v":""}]
[null,null,null,null,null,null,null,null,null,null,null,null,null,null,{"$f":"LEFT(A5,4)","v":""},{"$f":"LEFT(C5,4)","v":""},{"$f":"LEFT(H5,4)","v":""},{"$f":"LEFT(J5,4)","v":""}]
[{"$f":"'1e klasse'!H54","v":"O.Ootmarsum 6"},{"$f":"'1e klasse'!I54","v":"-"},{"$f":"'1e klasse'!J54","v":"Gunne 2"},4,"-",0,null,{"$f":"'2e klasse'!H54","v":"Soasel 3"},{"$f":"'2e klasse'!I54","v":"-"},{"$f":"'2e klasse'!J54","v":"Wilskracht 3"},4,"-",0,null,"O.Oo","Gunn","Soas","Wils"]
[{"$f":"'1e klasse'!H55","v":"Soasel 2"},{"$f":"'1e klasse'!I55","v":"-"},{"$f":"'1e klasse'!J55","v":"Hertme 4"},4,"-",0,null,{"$f":"'2e klasse'!H55","v":"Brink 4"},{"$f":"'2e klasse'!I55","v":"-"},{"$f":"'2e klasse'!J55","v":"Hertme 5"},0,"-",4,null,"Soas","Hert","Brin","Hert"]
[{"$f":"'1e klasse'!H56","v":"Lattr. Brekl. 4"},{"$f":"'1e klasse'!I56","v":"-"},{"$f":"'1e klasse'!J56","v":"O.Ootmarsum 5"},1,"-",3,null,{"$f":"'2e klasse'!H56","v":"Hertme 6"},{"$f":"'2e klasse'!I56","v":"-"},{"$f":"'2e klasse'!J56","v":"Soasel 4"},4,"-",0,null,"Latt","O.Oo","Hert","Soas"]
[{"$f":"'1e klasse'!H57","v":"Gunne 1"},{"$f":"'1e klasse'!I57","v":"-"},{"$f":"'1e klasse'!J57","v":"Soasel 1"},3,"-",1,null,{"$f":"'2e klasse'!H57","v":"Gunne 3"},{"$f":"'2e klasse'!I57","v":"-"},{"$f":"'2e klasse'!J57","v":"Brink 3"},0,"-",4,null,"Gunn","Soas","Gunn","Brin"]
[null,null,null,null,null,null,null,null,null,null,null,null,null,null,"","","",""]
["3e klasse",null,null,null,null,null,null,"4e klasse",null,null,null,null,null,null,"3e k","","4e k",""]
[null,null,null,null,null,null,null,null,null,null,null,null,null,null,"","","",""]
[{"$f":"'3e klasse'!H54","v":"Nijstad 3"},{"$f":"'3e klasse'!I54","v":"-"},{"$f":"'3e klasse'!J54","v":"Gunne 4"},4,"-",0,null,{"$f":"'4e klasse'!H54","v":"O.Ootmarsum 8"},{"$f":"'4e klasse'!I54","v":"-"},{"$f":"'4e klasse'!J54","v":"Lattr. Brekl. 6"},3,"-",1,null,"Nijs","Gunn","O.Oo","Latt"]
[{"$f":"'3e klasse'!H55","v":"Soasel 5"},{"$f":"'3e klasse'!I55","v":"-"},{"$f":"'3e klasse'!J55","v":"Lattr. Brekl. 5"},4,"-",0,null,{"$f":"'4e klasse'!H55","v":"vrij"},{"$f":"'4e klasse'!I55","v":"-"},{"$f":"'4e klasse'!J55","v":"Hertme 8"},null,"-",null,null,"Soas","Latt","vrij","Hert"]
[{"$f":"'3e klasse'!H56","v":"H.K.V. 1"},{"$f":"'3e klasse'!I56","v":"-"},{"$f":"'3e klasse'!J56","v":"Nijstad 2"},4,"-",0,null,{"$f":"'4e klasse'!H56","v":"Hertme 7"},{"$f":"'4e klasse'!I56","v":"-"},{"$f":"'4e klasse'!J56","v":"O.Ootmarsum 7"},0,"-",4,null,"H.K.","Nijs","Hert","O.Oo"]
[{"$f":"'3e klasse'!H57","v":"vrij"},{"$f":"'3e klasse'!I57","v":"-"},{"$f":"'3e klasse'!J57","v":"Wilskracht 4"},null,"-",null,null,{"$f":"'4e klasse'!H57","v":"Lattr. Brekl. 7"},{"$f":"'4e klasse'!I57","v":"-"},{"$f":"'4e klasse'!J57","v":"Soasel 6"},1,"-",3,null,"vrij","Wils","Latt","Soas"]
[null,null,null,null,null,null,null,null,null,null,null,null,null,null,"","","",""]
["5e klasse",null,null,null,null,null,null,"6e klasse",null,null,null,null,null,null,"5e k","","6e k",""]
[null,null,null,null,null,null,null,null,null,null,null,null,null,null,"","","",""]
[{"$f":"'5e klasse'!H54","v":"O.Ootmarsum 9"},{"$f":"'5e klasse'!I54","v":"-"},{"$f":"'5e klasse'!J54","v":"Gunne 5"},3,"-",1,null,{"$f":"'6e klasse'!H39","v":"Hertme 10"},{"$f":"'6e klasse'!I39","v":"-"},{"$f":"'6e klasse'!J39","v":"Wilskracht 5"},2,"-",2,null,"O.Oo","Gunn","Hert","Wils"]
[{"$f":"'5e klasse'!H55","v":"Soasel 7"},{"$f":"'5e klasse'!I55","v":"-"},{"$f":"'5e klasse'!J55","v":"Nijstad 4"},1,"-",3,null,{"$f":"'6e klasse'!H40","v":"Brink 5"},{"$f":"'6e klasse'!I40","v":"-"},{"$f":"'6e klasse'!J40","v":"Soasel 8"},4,"-",0,null,"Soas","Nijs","Brin","Soas"]
[{"$f":"'5e klasse'!H56","v":"Hertme 9"},{"$f":"'5e klasse'!I56","v":"-"},{"$f":"'5e klasse'!J56","v":"O.Ootmarsum 10"},1,"-",3,null,{"$f":"'6e klasse'!H41","v":"O.Ootmarsum 11"},{"$f":"'6e klasse'!I41","v":"-"},{"$f":"'6e klasse'!J41","v":"Lattr. Brekl. 9"},2,"-",2,null,"Hert","O.Oo","O.Oo","Latt"]
[{"$f":"'5e klasse'!H57","v":"vrij"},{"$f":"'5e klasse'!I57","v":"-"},{"$f":"'5e klasse'!J57","v":"Lattr. Brekl. 8"},null,"-",null,null,{"$f":"'6e klasse'!H42","v":" "},{"$f":"'6e klasse'!I42","v":" "},{"$f":"'6e klasse'!J42","v":" "},null,"-",null,null,"vrij","Latt"," "," "]
[null,null,null,null,null,null,null,null,null,null,null,null,null,null,"","","",""]
["7e klasse",null,null,null,null,null,null,null,null,null,null,null,null,null,"7e k","","",""]
[null,null,null,null,null,null,null,null,null,null,null,null,null,null,"","","",""]
[{"$f":"'7e klasse'!H39","v":"Gunne 6"},{"$f":"'7e klasse'!I39","v":"-"},{"$f":"'7e klasse'!J39","v":"Hertme 12"},0,"-",4,null,null,null,null,null,"-",null,null,"Gunn","Hert","",""]
[{"$f":"'7e klasse'!H40","v":"Lattr. Brekl. 10"},{"$f":"'7e klasse'!I40","v":"-"},{"$f":"'7e klasse'!J40","v":"Nijstad 5"},3,"-",1,null,null,null,null,null,"-",null,null,"Latt","Nijs","",""]
[{"$f":"'7e klasse'!H41","v":"Hertme 11"},{"$f":"'7e klasse'!I41","v":"-"},{"$f":"'7e klasse'!J41","v":"Brink 6"},3,"-",1,null,null,null,null,null,"-",null,null,"Hert","Brin","",""]
[{"$f":"'7e klasse'!H42","v":" "},{"$f":"'7e klasse'!I42","v":" "},{"$f":"'7e klasse'!J42","v":" "},null,"-",null,null,{"$f":"'6e klasse'!H42","v":" "},{"$f":"'6e klasse'!I42","v":" "},{"$f":"'6e klasse'!J42","v":" "},null,"-",null,null," "," "," "," "]
[]
[]
[]
[]
[null,null,"Thuis",null,null,null,null,"Uit",null,"Totaal",null,null,null,"Opgave"]
["Brink",null,{"$f":"COUNTIF($O$4:$O$30,LEFT(A36,4))+COUNTIF($Q$4:$Q$30,LEFT(A36,4))","v":2},null,null,null,null,{"$f":"COUNTIF($P$4:$P$30,LEFT(A36,4))+COUNTIF($R$4:$R$30,LEFT(A36,4))","v":2},null,{"$f":"C36+H36","v":4},null,null,null,7]
["Gunne",null,3,null,null,null,null,3,null,{"$f":"C37+H37","v":6},null,null,null,8]
["H.K.V.",null,1,null,null,null,null,0,null,1,null,null,null,4]
["Hertme",null,5,null,null,null,null,4,null,9,null,null,null,9]
["Lattr. Brekl.",null,3,null,null,null,null,4,null,7,null,null,null,10]
["Nijstad",null,1,null,null,null,null,3,null,4,null,null,null,7]
["O.Ootmarsum",null,4,null,null,null,null,3,null,7,null,null,null,12]
["Soasel",null,4,null,null,null,null,4,null,8,null,null,null,4]
["Vijfsprong",null,0,null,null,null,null,0,null,0,null,null,null,3]
["Wilskracht",null,0,null,null,null,null,3,null,3,null,null,null,6]
[]
[null,null,{"$f":"SUM(C36:C46)","v":23},null,null,null,null,{"$f":"SUM(H36:H46)","v":26},null,{"$f":"SUM(J36:J46)","v":49},null,null,null,{"$f":"SUM(N36:N46)","v":70}]

{"sheet":"wedstr. 14","index":15,"n_rows":47,"n_cols":18,"rows_kept":47,"cut":false,"hidden":false,"merged":[]}
["14e Speeldag",null,"Start",null,null,null,null,"senioren"]
[]
[]
["1e Klasse",null,null,null,null,null,null,"2e Klasse",null,null,null,null,null,null,{"$f":"LEFT(A4,4)","v":"1e K"},{"$f":"LEFT(C4,4)","v":""},{"$f":"LEFT(H4,4)","v":"2e K"},{"$f":"LEFT(J4,4)","v":""}]
[null,null,null,null,null,null,null,null,null,null,null,null,null,null,{"$f":"LEFT(A5,4)","v":""},{"$f":"LEFT(C5,4)","v":""},{"$f":"LEFT(H5,4)","v":""},{"$f":"LEFT(J5,4)","v":""}]
[{"$f":"'1e klasse'!H62","v":"O.Ootmarsum 6"},{"$f":"'1e klasse'!I62","v":"-"},{"$f":"'1e klasse'!J62","v":"Soasel 2"},0,"-",4,null,{"$f":"'2e klasse'!H62","v":"Soasel 3"},{"$f":"'2e klasse'!I62","v":"-"},{"$f":"'2e klasse'!J62","v":"Brink 4"},2,"-",2,null,"O.Oo","Soas","Soas","Brin"]
[{"$f":"'1e klasse'!H63","v":"Lattr. Brekl. 4"},{"$f":"'1e klasse'!I63","v":"-"},{"$f":"'1e klasse'!J63","v":"Gunne 1"},0,"-",4,null,{"$f":"'2e klasse'!H63","v":"Hertme 6"},{"$f":"'2e klasse'!I63","v":"-"},{"$f":"'2e klasse'!J63","v":"Gunne 3"},0,"-",4,null,"Latt","Gunn","Hert","Gunn"]
[{"$f":"'1e klasse'!H64","v":"Soasel 1"},{"$f":"'1e klasse'!I64","v":"-"},{"$f":"'1e klasse'!J64","v":"O.Ootmarsum 5"},2,"-",2,null,{"$f":"'2e klasse'!H64","v":"Brink 3"},{"$f":"'2e klasse'!I64","v":"-"},{"$f":"'2e klasse'!J64","v":"Soasel 4"},3,"-",1,null,"Soas","O.Oo","Brin","Soas"]
[{"$f":"'1e klasse'!H65","v":"Gunne 2"},{"$f":"'1e klasse'!I65","v":"-"},{"$f":"'1e klasse'!J65","v":"Hertme 4"},4,"-",0,null,{"$f":"'2e klasse'!H65","v":"Wilskracht 3"},{"$f":"'2e klasse'!I65","v":"-"},{"$f":"'2e klasse'!J65","v":"Hertme 5"},0,"-",4,null,"Gunn","Hert","Wils","Hert"]
[null,null,null,null,null,null,null,null,null,null,null,null,null,null,"","","",""]
["3e klasse",null,null,null,null,null,null,"4e klasse",null,null,null,null,null,null,"3e k","","4e k",""]
[null,null,null,null,null,null,null,null,null,null,null,null,null,null,"","","",""]
[{"$f":"'3e klasse'!H62","v":"Nijstad 3"},{"$f":"'3e klasse'!I62","v":"-"},{"$f":"'3e klasse'!J62","v":"Soasel 5"},4,"-",0,null,{"$f":"'4e klasse'!H62","v":"O.Ootmarsum 8"},{"$f":"'4e klasse'!I62","v":"-"},{"$f":"'4e klasse'!J62","v":"vrij"},null,"-",null,null,"Nijs","Soas","O.Oo","vrij"]
[{"$f":"'3e klasse'!H63","v":"H.K.V. 1"},{"$f":"'3e klasse'!I63","v":"-"},{"$f":"'3e klasse'!J63","v":"vrij"},null,"-",null,null,{"$f":"'4e klasse'!H63","v":"Hertme 7"},{"$f":"'4e klasse'!I63","v":"-"},{"$f":"'4e klasse'!J63","v":"Lattr. Brekl. 7"},2,"-",2,null,"H.K.","vrij","Hert","Latt"]
[{"$f":"'3e klasse'!H64","v":"Wilskracht 4"},{"$f":"'3e klasse'!I64","v":"-"},{"$f":"'3e klasse'!J64","v":"Nijstad 2"},4,"-",0,null,{"$f":"'4e klasse'!H64","v":"Soasel 6"},{"$f":"'4e klasse'!I64","v":"-"},{"$f":"'4e klasse'!J64","v":"O.Ootmarsum 7"},0,"-",4,null,"Wils","Nijs","Soas","O.Oo"]
[{"$f":"'3e klasse'!H65","v":"Gunne 4"},{"$f":"'3e klasse'!I65","v":"-"},{"$f":"'3e klasse'!J65","v":"Lattr. Brekl. 5"},0,null,4,null,{"$f":"'4e klasse'!H65","v":"Lattr. Brekl. 6"},{"$f":"'4e klasse'!I65","v":"-"},{"$f":"'4e klasse'!J65","v":"Hertme 8"},4,"-",0,null,"Gunn","Latt","Latt","Hert"]
[null,null,null,null,null,null,null,null,null,null,null,null,null,null,"","","",""]
["5e klasse",null,null,null,null,null,null,"6e klasse",null,null,null,null,null,null,"5e k","","6e k",""]
[null,null,null,null,null,null,null,null,null,null,null,null,null,null,"","","",""]
[{"$f":"'5e klasse'!H62","v":"O.Ootmarsum 9"},{"$f":"'5e klasse'!I62","v":"-"},{"$f":"'5e klasse'!J62","v":"Soasel 7"},4,"-",0,null,{"$f":"'6e klasse'!H45","v":"Brink 5"},{"$f":"'6e klasse'!I45","v":"-"},{"$f":"'6e klasse'!J45","v":"Hertme 10"},4,"-",0,null,"O.Oo","Soas","Brin","Hert"]
[{"$f":"'5e klasse'!H63","v":"Hertme 9"},{"$f":"'5e klasse'!I63","v":"-"},{"$f":"'5e klasse'!J63","v":"vrij"},null,"-",null,null,{"$f":"'6e klasse'!H46","v":"Wilskracht 5"},{"$f":"'6e klasse'!I46","v":"-"},{"$f":"'6e klasse'!J46","v":"Lattr. Brekl. 9"},2,"-",2,null,"Hert","vrij","Wils","Latt"]
[{"$f":"'5e klasse'!H64","v":"Lattr. Brekl. 8"},{"$f":"'5e klasse'!I64","v":"-"},{"$f":"'5e klasse'!J64","v":"O.Ootmarsum 10"},0,"-",4,null,{"$f":"'6e klasse'!H47","v":"Soasel 8"},{"$f":"'6e klasse'!I47","v":"-"},{"$f":"'6e klasse'!J47","v":"O.Ootmarsum 11"},3,"-",1,null,"Latt","O.Oo","Soas","O.Oo"]
[{"$f":"'5e klasse'!H65","v":"Gunne 5"},{"$f":"'5e klasse'!I65","v":"-"},{"$f":"'5e klasse'!J65","v":"Nijstad 4"},3,"-",1,null,{"$f":"'6e klasse'!H48","v":" "},{"$f":"'6e klasse'!I48","v":" "},{"$f":"'6e klasse'!J48","v":" "},null,"-",null,null,"Gunn","Nijs"," "," "]
[null,null,null,null,null,null,null,null,null,null,null,null,null,null,"","","",""]
["7e klasse",null,null,null,null,null,null,null,null,null,null,null,null,null,"7e k","","",""]
[null,null,null,null,null,null,null,null,null,null,null,null,null,null,"","","",""]
[{"$f":"'7e klasse'!H45","v":"Lattr. Brekl. 10"},{"$f":"'7e klasse'!I45","v":"-"},{"$f":"'7e klasse'!J45","v":"Gunne 6"},4,"-",0,null,null,null,null,null,"-",null,null,"Latt","Gunn","",""]
[{"$f":"'7e klasse'!H46","v":"Hertme 12"},{"$f":"'7e klasse'!I46","v":"-"},{"$f":"'7e klasse'!J46","v":"Brink 6"},0,"-",4,null,null,null,null,null,"-",null,null,"Hert","Brin","",""]
[{"$f":"'7e klasse'!H47","v":"Nijstad 5"},{"$f":"'7e klasse'!I47","v":"-"},{"$f":"'7e klasse'!J47","v":"Hertme 11"},0,"-",4,null,null,null,null,null,"-",null,null,"Nijs","Hert","",""]
[{"$f":"'7e klasse'!H48","v":" "},{"$f":"'7e klasse'!I48","v":" "},{"$f":"'7e klasse'!J48","v":" "},null,"-",null,null,{"$f":"'6e klasse'!H48","v":" "},{"$f":"'6e klasse'!I48","v":" "},{"$f":"'6e klasse'!J48","v":" "},null,"-",null,null," "," "," "," "]
[]
[]
[]
[]
[null,null,"Thuis",null,null,null,null,"Uit",null,"Totaal",null,null,null,"Opgave"]
["Brink",null,{"$f":"COUNTIF($O$4:$O$30,LEFT(A36,4))+COUNTIF($Q$4:$Q$30,LEFT(A36,4))","v":2},null,null,null,null,{"$f":"COUNTIF($P$4:$P$30,LEFT(A36,4))+COUNTIF($R$4:$R$30,LEFT(A36,4))","v":2},null,{"$f":"C36+H36","v":4},null,null,null,7]
["Gunne",null,3,null,null,null,null,3,null,{"$f":"C37+H37","v":6},null,null,null,8]
["H.K.V.",null,1,null,null,null,null,0,null,1,null,null,null,4]
["Hertme",null,4,null,null,null,null,5,null,9,null,null,null,9]
["Lattr. Brekl.",null,4,null,null,null,null,3,null,7,null,null,null,10]
["Nijstad",null,2,null,null,null,null,2,null,4,null,null,null,7]
["O.Ootmarsum",null,3,null,null,null,null,4,null,7,null,null,null,12]
["Soasel",null,4,null,null,null,null,4,null,8,null,null,null,4]
["Vijfsprong",null,0,null,null,null,null,0,null,0,null,null,null,3]
["Wilskracht",null,3,null,null,null,null,0,null,3,null,null,null,6]
[]
[null,null,{"$f":"SUM(C36:C46)","v":26},null,null,null,null,{"$f":"SUM(H36:H46)","v":23},null,{"$f":"SUM(J36:J46)","v":49},null,null,null,{"$f":"SUM(N36:N46)","v":70}]

{"sheet":"wedstr. 15","index":16,"n_rows":32,"n_cols":18,"rows_kept":32,"cut":false,"hidden":false,"merged":[]}
["15e Speeldag",null,"Start",null,null,null,null,"senioren"]
[]
[]
["6e klasse",null,null,null,null,null,null,"7e klasse",null,null,null,null,null,null,{"$f":"LEFT(A4,4)","v":"6e k"},{"$f":"LEFT(C4,4)","v":""},{"$f":"LEFT(H4,4)","v":"7e k"},{"$f":"LEFT(J4,4)","v":""}]
[null,null,null,null,null,null,null,null,null,null,null,null,null,null,"","","",""]
[{"$f":"'6e klasse'!H51","v":"Wilskracht 5"},{"$f":"'6e klasse'!I51","v":"-"},{"$f":"'6e klasse'!J51","v":"Brink 5"},3,"-",1,null,{"$f":"'7e klasse'!H51","v":"Hertme 12"},{"$f":"'7e klasse'!I51","v":"-"},{"$f":"'7e klasse'!J51","v":"Lattr. Brekl. 10"},4,"-",0,null,"Wils","Brin","Hert","Latt"]
[{"$f":"'6e klasse'!H52","v":"Hertme 10"},{"$f":"'6e klasse'!I52","v":"-"},{"$f":"'6e klasse'!J52","v":"O.Ootmarsum 11"},4,"-",0,null,{"$f":"'7e klasse'!H52","v":"Gunne 6"},{"$f":"'7e klasse'!I52","v":"-"},{"$f":"'7e klasse'!J52","v":"Hertme 11"},0,"-",4,null,"Hert","O.Oo","Gunn","Hert"]
[{"$f":"'6e klasse'!H53","v":"Lattr. Brekl. 9"},{"$f":"'6e klasse'!I53","v":"-"},{"$f":"'6e klasse'!J53","v":"Soasel 8"},3,"-",1,null,{"$f":"'7e klasse'!H53","v":"Brink 6"},{"$f":"'7e klasse'!I53","v":"-"},{"$f":"'7e klasse'!J53","v":"Nijstad 5"},3,"-",1,null,"Latt","Soas","Brin","Nijs"]
[null,null,null,null,null,null,null,null,null,null,null,null,null,null,"","","",""]
[null,null,null,null,null,null,null,null,null,null,null,null,null,null,"","","",""]
[null,null,null,null,null,null,null,null,null,null,null,null,null,null,"","","",""]
[null,null,null,null,null,null,null,null,null,null,null,null,null,null,"","","",""]
[null,null,null,null,null,null,null,null,null,null,null,null,null,null,"","","",""]
[null,null,null,null,null,null,null,null,null,null,null,null,null,null,"","","",""]
[null,null,null,null,null,null,null,null,null,null,null,null,null,null,"","","",""]
[]
[]
[]
[]
[null,null,"Thuis",null,null,null,null,"Uit",null,"Totaal",null,null,null,"Opgave"]
["Brink",null,{"$f":"COUNTIF($O$4:$O$15,LEFT(A21,4))+COUNTIF($Q$4:$Q$15,LEFT(A21,4))","v":1},null,null,null,null,{"$f":"COUNTIF($P$4:$P$15,LEFT(A21,4))+COUNTIF($R$4:$R$15,LEFT(A21,4))","v":1},null,{"$f":"C21+H21","v":2},null,null,null,7]
["Gunne",null,1,null,null,null,null,0,null,1,null,null,null,8]
["H.K.V.",null,0,null,null,null,null,0,null,0,null,null,null,4]
["Hertme",null,2,null,null,null,null,1,null,3,null,null,null,9]
["Lattr. Brekl.",null,1,null,null,null,null,1,null,2,null,null,null,10]
["Nijstad",null,0,null,null,null,null,1,null,1,null,null,null,7]
["O.Ootmarsum",null,0,null,null,null,null,1,null,1,null,null,null,12]
["Soasel",null,0,null,null,null,null,1,null,1,null,null,null,4]
["Vijfsprong",null,0,null,null,null,null,0,null,0,null,null,null,3]
["Wilskracht",null,1,null,null,null,null,0,null,1,null,null,null,6]
[]
[null,null,{"$f":"SUM(C21:C31)","v":6},null,null,null,null,{"$f":"SUM(H21:H31)","v":6},null,{"$f":"SUM(J21:J31)","v":12},null,null,null,{"$f":"SUM(N21:N31)","v":70}]

{"sheet":"Baanbezetting","index":17,"n_rows":15,"n_cols":19,"rows_kept":15,"cut":false,"hidden":false,"merged":[]}
[]
["Baanbezetting",null,"Aantal thuisspelende teams per wedstrijddag",null,null,null,null,null,null,null,null,"Start"]
[]
[null,"W1","W2","W3","W4","W5","W6","W7","W8","W9","W10","W11","W12","W13","W14","W15"]
["Brink",{"$f":"'Wedstr. 1'!C36","v":2},{"$f":"'wedstr. 2'!C36","v":2},{"$f":"'wedstr. 3'!C36","v":2},{"$f":"'wedstr. 4'!C36","v":2},{"$f":"'wedstr. 5'!C36","v":2},{"$f":"'wedstr. 6'!C36","v":2},{"$f":"'wedstr. 7'!C36","v":2},{"$f":"'wedstr. 8'!C36","v":2},{"$f":"'wedstr. 9'!C36","v":2},{"$f":"'wedstr. 10'!C36","v":2},{"$f":"'wedstr. 11'!C36","v":2},{"$f":"'wedstr. 12'!C36","v":2},{"$f":"'wedstr. 13'!C36","v":2},{"$f":"'wedstr. 14'!C36","v":2},{"$f":"'wedstr. 15'!C21","v":1},4,null,"Brink"]
["Gunne",{"$f":"'Wedstr. 1'!C37","v":4},{"$f":"'wedstr. 2'!C37","v":2},{"$f":"'wedstr. 3'!C37","v":4},{"$f":"'wedstr. 4'!C37","v":2},{"$f":"'wedstr. 5'!C37","v":3},{"$f":"'wedstr. 6'!C37","v":3},{"$f":"'wedstr. 7'!C37","v":3},{"$f":"'wedstr. 8'!C37","v":2},{"$f":"'wedstr. 9'!C37","v":4},{"$f":"'wedstr. 10'!C37","v":2},{"$f":"'wedstr. 11'!C37","v":4},{"$f":"'wedstr. 12'!C37","v":3},{"$f":"'wedstr. 13'!C37","v":3},{"$f":"'wedstr. 14'!C37","v":3},{"$f":"'wedstr. 15'!C22","v":1},6,null,"Gunne"]
["H.K.V.",{"$f":"'Wedstr. 1'!C38","v":0},{"$f":"'wedstr. 2'!C38","v":1},{"$f":"'wedstr. 3'!C38","v":0},{"$f":"'wedstr. 4'!C38","v":1},{"$f":"'wedstr. 5'!C38","v":1},{"$f":"'wedstr. 6'!C38","v":0},{"$f":"'wedstr. 7'!C38","v":0},{"$f":"'wedstr. 8'!C38","v":1},{"$f":"'wedstr. 9'!C38","v":0},{"$f":"'wedstr. 10'!C38","v":1},{"$f":"'wedstr. 11'!C38","v":0},{"$f":"'wedstr. 12'!C38","v":0},{"$f":"'wedstr. 13'!C38","v":1},{"$f":"'wedstr. 14'!C38","v":1},{"$f":"'wedstr. 15'!C23","v":0},1,null,"H.K.V."]
["Hertme",{"$f":"'Wedstr. 1'!C39","v":5},{"$f":"'wedstr. 2'!C39","v":4},{"$f":"'wedstr. 3'!C39","v":5},{"$f":"'wedstr. 4'!C39","v":4},{"$f":"'wedstr. 5'!C39","v":5},{"$f":"'wedstr. 6'!C39","v":4},{"$f":"'wedstr. 7'!C39","v":5},{"$f":"'wedstr. 8'!C39","v":4},{"$f":"'wedstr. 9'!C39","v":5},{"$f":"'wedstr. 10'!C39","v":4},{"$f":"'wedstr. 11'!C39","v":5},{"$f":"'wedstr. 12'!C39","v":4},{"$f":"'wedstr. 13'!C39","v":5},{"$f":"'wedstr. 14'!C39","v":4},{"$f":"'wedstr. 15'!C24","v":2},9,null,"Hertme"]
["Lattr. Brekl.",{"$f":"'Wedstr. 1'!C40","v":3},{"$f":"'wedstr. 2'!C40","v":4},{"$f":"'wedstr. 3'!C40","v":3},{"$f":"'wedstr. 4'!C40","v":4},{"$f":"'wedstr. 5'!C40","v":3},{"$f":"'wedstr. 6'!C40","v":4},{"$f":"'wedstr. 7'!C40","v":3},{"$f":"'wedstr. 8'!C40","v":4},{"$f":"'wedstr. 9'!C40","v":3},{"$f":"'wedstr. 10'!C40","v":4},{"$f":"'wedstr. 11'!C40","v":3},{"$f":"'wedstr. 12'!C40","v":4},{"$f":"'wedstr. 13'!C40","v":3},{"$f":"'wedstr. 14'!C40","v":4},{"$f":"'wedstr. 15'!C25","v":1},7,null,"Lattr. Brekl."]
["Nijstad",{"$f":"'Wedstr. 1'!C41","v":2},{"$f":"'wedstr. 2'!C41","v":2},{"$f":"'wedstr. 3'!C41","v":2},{"$f":"'wedstr. 4'!C41","v":2},{"$f":"'wedstr. 5'!C41","v":1},{"$f":"'wedstr. 6'!C41","v":3},{"$f":"'wedstr. 7'!C41","v":2},{"$f":"'wedstr. 8'!C41","v":2},{"$f":"'wedstr. 9'!C41","v":2},{"$f":"'wedstr. 10'!C41","v":2},{"$f":"'wedstr. 11'!C41","v":2},{"$f":"'wedstr. 12'!C41","v":3},{"$f":"'wedstr. 13'!C41","v":1},{"$f":"'wedstr. 14'!C41","v":2},{"$f":"'wedstr. 15'!C26","v":0},4,null,"Nijstad"]
["O.Ootmarsum",{"$f":"'Wedstr. 1'!C42","v":3},{"$f":"'wedstr. 2'!C42","v":4},{"$f":"'wedstr. 3'!C42","v":4},{"$f":"'wedstr. 4'!C42","v":3},{"$f":"'wedstr. 5'!C42","v":3},{"$f":"'wedstr. 6'!C42","v":4},{"$f":"'wedstr. 7'!C42","v":3},{"$f":"'wedstr. 8'!C42","v":3},{"$f":"'wedstr. 9'!C42","v":4},{"$f":"'wedstr. 10'!C42","v":4},{"$f":"'wedstr. 11'!C42","v":3},{"$f":"'wedstr. 12'!C42","v":4},{"$f":"'wedstr. 13'!C42","v":4},{"$f":"'wedstr. 14'!C42","v":3},{"$f":"'wedstr. 15'!C27","v":0},7,null,"O.Ootmarsum"]
["Soasel",{"$f":"'Wedstr. 1'!C43","v":4},{"$f":"'wedstr. 2'!C43","v":4},{"$f":"'wedstr. 3'!C43","v":4},{"$f":"'wedstr. 4'!C43","v":4},{"$f":"'wedstr. 5'!C43","v":4},{"$f":"'wedstr. 6'!C43","v":4},{"$f":"'wedstr. 7'!C43","v":4},{"$f":"'wedstr. 8'!C43","v":4},{"$f":"'wedstr. 9'!C43","v":4},{"$f":"'wedstr. 10'!C43","v":4},{"$f":"'wedstr. 11'!C43","v":4},{"$f":"'wedstr. 12'!C43","v":4},{"$f":"'wedstr. 13'!C43","v":4},{"$f":"'wedstr. 14'!C43","v":4},{"$f":"'wedstr. 15'!C28","v":0},8,null,"Soasel"]
["Wilskracht",{"$f":"'Wedstr. 1'!C45","v":2},{"$f":"'wedstr. 2'!C45","v":1},{"$f":"'wedstr. 3'!C45","v":1},{"$f":"'wedstr. 4'!C45","v":2},{"$f":"'wedstr. 5'!C45","v":1},{"$f":"'wedstr. 6'!C45","v":2},{"$f":"'wedstr. 7'!C45","v":1},{"$f":"'wedstr. 8'!C45","v":2},{"$f":"'wedstr. 9'!C45","v":1},{"$f":"'wedstr. 10'!C45","v":1},{"$f":"'wedstr. 11'!C45","v":2},{"$f":"'wedstr. 12'!C45","v":2},{"$f":"'wedstr. 13'!C45","v":0},{"$f":"'wedstr. 14'!C45","v":3},{"$f":"'wedstr. 15'!C30","v":1},3,null,"Wilskracht"]
[]
["Totaal",{"$f":"SUM(B5:B14)","v":25},{"$f":"SUM(C5:C14)","v":24},25,24,23,26,23,24,25,24,25,26,23,26,{"$f":"'wedstr. 15'!C32","v":6},{"$f":"SUM(Q5:Q14)","v":49}]

{"sheet":"1e klasse","index":18,"n_rows":65,"n_cols":18,"rows_kept":65,"cut":false,"hidden":false,"merged":[]}
[null,null,"1e klasse"]
[null,null,"Team","G",null,"P"]
[]
[null,"A","Soasel 2",{"$f":"COUNTIF($O$15:$R$65,C4)","v":14},"-",{"$f":"SUMIF($A$15:$A$65,C4,$D$15:$D$65)+SUMIF($C$15:$C$65,C4,$F$15:$F$65)+SUMIF($H$15:$H$65,C4,$K$15:$K$65)+SUMIF($J$15:$J$65,C4,$M$15:$M$65)","v":25},null,null,null,"Gunne 1",{"$f":"COUNTIF($O$15:$R$65,J4)","v":14},"-",{"$f":"SUMIF($A$15:$A$65,J4,$D$15:$D$65)+SUMIF($C$15:$C$65,J4,$F$15:$F$65)+SUMIF($H$15:$H$65,J4,$K$15:$K$65)+SUMIF($J$15:$J$65,J4,$M$15:$M$65)","v":52}]
[null,"B","Gunne 2",{"$f":"COUNTIF($O$15:$R$65,C5)","v":14},"-",23,null,null,null,"Gunne 2",14,"-",23]
[null,"C","O.Ootmarsum 6",14,"-",{"$f":"SUMIF($A$15:$A$65,C6,$D$15:$D$65)+SUMIF($C$15:$C$65,C6,$F$15:$F$65)+SUMIF($H$15:$H$65,C6,$K$15:$K$65)+SUMIF($J$15:$J$65,C6,$M$15:$M$65)","v":17},null,null,null,"Hertme 4",14,"-",8]
[null,"D","Hertme 4",14,"-",8,null,null,null,"Lattr. Brekl. 4",14,"-",21]
[null,"E","Gunne 1",14,"-",52,null,null,null,"O.Ootmarsum 5",14,"-",34]
[null,"F","O.Ootmarsum 5",14,"-",34,null,null,null,"O.Ootmarsum 6",14,"-",17]
[null,"G","Lattr. Brekl. 4",{"$f":"COUNTIF($O$15:$R$65,C10)","v":14},"-",{"$f":"SUMIF($A$15:$A$65,C10,$D$15:$D$65)+SUMIF($C$15:$C$65,C10,$F$15:$F$65)+SUMIF($H$15:$H$65,C10,$K$15:$K$65)+SUMIF($J$15:$J$65,C10,$M$15:$M$65)","v":21},null,null,null,"Soasel 1",14,"-",44]
[null,"H","Soasel 1",14,"-",44,null,null,null,"Soasel 2",14,"-",25]
[]
[null,1,null,null,null,null,null,null,8]
[]
[{"$f":"C4","v":"Soasel 2"},"-",{"$f":"C8","v":"Gunne 1"},{"$f":"'Wedstr. 1'!D6","v":0},"-",{"$f":"'Wedstr. 1'!F6","v":4},null,{"$f":"C8","v":"Gunne 1"},"-",{"$f":"C4","v":"Soasel 2"},{"$f":"'wedstr. 8'!D6","v":4},"-",{"$f":"'wedstr. 8'!F6","v":0},null,{"$f":"IF($D15+$F15=4,A15,)","v":"Soasel 2"},{"$f":"IF($D15+$F15=4,C15,)","v":"Gunne 1"},{"$f":"IF($K15+$M15=4,H15,)","v":"Gunne 1"},{"$f":"IF($K15+$M15=4,J15,)","v":"Soasel 2"}]
[{"$f":"C5","v":"Gunne 2"},"-",{"$f":"C9","v":"O.Ootmarsum 5"},{"$f":"'Wedstr. 1'!D7","v":3},"-",{"$f":"'Wedstr. 1'!F7","v":1},null,{"$f":"C9","v":"O.Ootmarsum 5"},"-",{"$f":"C5","v":"Gunne 2"},{"$f":"'wedstr. 8'!D7","v":3},"-",{"$f":"'wedstr. 8'!F7","v":1},null,{"$f":"IF($D16+$F16=4,A16,)","v":"Gunne 2"},{"$f":"IF($D16+$F16=4,C16,)","v":"O.Ootmarsum 5"},"O.Ootmarsum 5",{"$f":"IF($K16+$M16=4,J16,)","v":"Gunne 2"}]
[{"$f":"C6","v":"O.Ootmarsum 6"},"-",{"$f":"C10","v":"Lattr. Brekl. 4"},{"$f":"'Wedstr. 1'!D8","v":1},"-",{"$f":"'Wedstr. 1'!F8","v":3},null,{"$f":"C10","v":"Lattr. Brekl. 4"},"-",{"$f":"C6","v":"O.Ootmarsum 6"},{"$f":"'wedstr. 8'!D8","v":1},"-",{"$f":"'wedstr. 8'!F8","v":3},null,"O.Ootmarsum 6","Lattr. Brekl. 4","Lattr. Brekl. 4","O.Ootmarsum 6"]
[{"$f":"C7","v":"Hertme 4"},"-",{"$f":"C11","v":"Soasel 1"},{"$f":"'Wedstr. 1'!D9","v":0},"-",{"$f":"'Wedstr. 1'!F9","v":4},null,{"$f":"C11","v":"Soasel 1"},"-",{"$f":"C7","v":"Hertme 4"},{"$f":"'wedstr. 8'!D9","v":4},"-",{"$f":"'wedstr. 8'!F9","v":0},null,"Hertme 4","Soasel 1","Soasel 1","Hertme 4"]
[null,null,null,null,null,null,null,null,null,null,null,null,null,null,0,0,0,0]
[null,2,null,null,null,null,null,null,9,null,null,null,null,null,0,0,0,0]
[null,null,null,null,null,null,null,null,null,null,null,null,null,null,0,0,0,0]
[{"$f":"C8","v":"Gunne 1"},"-",{"$f":"C5","v":"Gunne 2"},{"$f":"'wedstr. 2'!D6","v":3},"-",{"$f":"'wedstr. 2'!F6","v":1},null,{"$f":"C5","v":"Gunne 2"},"-",{"$f":"C8","v":"Gunne 1"},{"$f":"'wedstr. 9'!D6","v":0},"-",{"$f":"'wedstr. 9'!F6","v":4},null,"Gunne 1","Gunne 2","Gunne 2","Gunne 1"]
[{"$f":"C9","v":"O.Ootmarsum 5"},"-",{"$f":"C6","v":"O.Ootmarsum 6"},{"$f":"'wedstr. 2'!D7","v":3},"-",{"$f":"'wedstr. 2'!F7","v":1},null,{"$f":"C6","v":"O.Ootmarsum 6"},"-",{"$f":"C9","v":"O.Ootmarsum 5"},{"$f":"'wedstr. 9'!D7","v":3},"-",{"$f":"'wedstr. 9'!F7","v":1},null,"O.Ootmarsum 5","O.Ootmarsum 6","O.Ootmarsum 6","O.Ootmarsum 5"]
[{"$f":"C10","v":"Lattr. Brekl. 4"},"-",{"$f":"C7","v":"Hertme 4"},{"$f":"'wedstr. 2'!D8","v":4},"-",{"$f":"'wedstr. 2'!F8","v":0},null,{"$f":"C7","v":"Hertme 4"},"-",{"$f":"C10","v":"Lattr. Brekl. 4"},{"$f":"'wedstr. 9'!D8","v":2},"-",{"$f":"'wedstr. 9'!F8","v":2},null,"Lattr. Brekl. 4","Hertme 4","Hertme 4","Lattr. Brekl. 4"]
[{"$f":"C11","v":"Soasel 1"},"-",{"$f":"C4","v":"Soasel 2"},{"$f":"'wedstr. 2'!D9","v":4},"-",{"$f":"'wedstr. 2'!F9","v":0},null,{"$f":"C4","v":"Soasel 2"},"-",{"$f":"C11","v":"Soasel 1"},{"$f":"'wedstr. 9'!D9","v":0},"-",{"$f":"'wedstr. 9'!F9","v":4},null,"Soasel 1","Soasel 2","Soasel 2","Soasel 1"]
[null,null,null,null,null,null,null,null,null,null,null,null,null,null,0,0,0,0]
[null,null,null,null,null,null,null,null,null,null,null,null,null,null,0,0,0,0]
[null,3,null,null,null,null,null,null,10,null,null,null,null,null,0,0,0,0]
[null,null,null,null,null,null,null,null,null,null,null,null,null,null,0,0,0,0]
[{"$f":"C4","v":"Soasel 2"},"-",{"$f":"C9","v":"O.Ootmarsum 5"},{"$f":"'wedstr. 3'!D6","v":1},"-",{"$f":"'wedstr. 3'!F6","v":3},null,{"$f":"C9","v":"O.Ootmarsum 5"},"-",{"$f":"C4","v":"Soasel 2"},{"$f":"'wedstr. 10'!D6","v":3},"-",{"$f":"'wedstr. 10'!F6","v":1},null,"Soasel 2","O.Ootmarsum 5","O.Ootmarsum 5","Soasel 2"]
[{"$f":"C5","v":"Gunne 2"},"-",{"$f":"C10","v":"Lattr. Brekl. 4"},{"$f":"'wedstr. 3'!D7","v":1},"-",{"$f":"'wedstr. 3'!F7","v":3},null,{"$f":"C10","v":"Lattr. Brekl. 4"},"-",{"$f":"C5","v":"Gunne 2"},{"$f":"'wedstr. 10'!D7","v":2},"-",{"$f":"'wedstr. 10'!F7","v":2},null,"Gunne 2","Lattr. Brekl. 4","Lattr. Brekl. 4","Gunne 2"]
[{"$f":"C6","v":"O.Ootmarsum 6"},"-",{"$f":"C11","v":"Soasel 1"},{"$f":"'wedstr. 3'!D8","v":1},"-",{"$f":"'wedstr. 3'!F8","v":3},null,{"$f":"C11","v":"Soasel 1"},"-",{"$f":"C6","v":"O.Ootmarsum 6"},{"$f":"'wedstr. 10'!D8","v":4},"-",{"$f":"'wedstr. 10'!F8","v":0},null,"O.Ootmarsum 6","Soasel 1","Soasel 1","O.Ootmarsum 6"]
[{"$f":"C7","v":"Hertme 4"},"-",{"$f":"C8","v":"Gunne 1"},{"$f":"'wedstr. 3'!D9","v":0},"-",{"$f":"'wedstr. 3'!F9","v":4},null,{"$f":"C8","v":"Gunne 1"},"-",{"$f":"C7","v":"Hertme 4"},{"$f":"'wedstr. 10'!D9","v":4},"-",{"$f":"'wedstr. 10'!F9","v":0},null,"Hertme 4","Gunne 1","Gunne 1","Hertme 4"]
[null,null,null,null,null,null,null,null,null,null,null,null,null,null,0,0,0,0]
[null,null,null,null,null,null,null,null,null,null,null,null,null,null,0,0,0,0]
[null,4,null,null,null,null,null,null,11,null,null,null,null,null,0,0,0,0]
[null,null,null,null,null,null,null,null,null,null,null,null,null,null,0,0,0,0]
[{"$f":"C8","v":"Gunne 1"},"-",{"$f":"C6","v":"O.Ootmarsum 6"},{"$f":"'wedstr. 4'!D6","v":4},"-",{"$f":"'wedstr. 4'!F6","v":0},null,{"$f":"C6","v":"O.Ootmarsum 6"},"-",{"$f":"C8","v":"Gunne 1"},{"$f":"'wedstr. 11'!D6","v":0},"-",{"$f":"'wedstr. 11'!F6","v":4},null,"Gunne 1","O.Ootmarsum 6","O.Ootmarsum 6","Gunne 1"]
[{"$f":"C9","v":"O.Ootmarsum 5"},"-",{"$f":"C7","v":"Hertme 4"},{"$f":"'wedstr. 4'!D7","v":4},"-",{"$f":"'wedstr. 4'!F7","v":0},null,{"$f":"C7","v":"Hertme 4"},"-",{"$f":"C9","v":"O.Ootmarsum 5"},{"$f":"'wedstr. 11'!D7","v":0},"-",{"$f":"'wedstr. 11'!F7","v":4},null,"O.Ootmarsum 5","Hertme 4","Hertme 4","O.Ootmarsum 5"]
[{"$f":"C10","v":"Lattr. Brekl. 4"},"-",{"$f":"C4","v":"Soasel 2"},{"$f":"'wedstr. 4'!D8","v":3},"-",{"$f":"'wedstr. 4'!F8","v":1},null,{"$f":"C4","v":"Soasel 2"},"-",{"$f":"C10","v":"Lattr. Brekl. 4"},{"$f":"'wedstr. 11'!D8","v":2},"-",{"$f":"'wedstr. 11'!F8","v":2},null,"Lattr. Brekl. 4","Soasel 2","Soasel 2","Lattr. Brekl. 4"]
[{"$f":"C11","v":"Soasel 1"},"-",{"$f":"C5","v":"Gunne 2"},{"$f":"'wedstr. 4'!D9","v":3},"-",{"$f":"'wedstr. 4'!F9","v":1},null,{"$f":"C5","v":"Gunne 2"},"-",{"$f":"C11","v":"Soasel 1"},{"$f":"'wedstr. 11'!D9","v":0},"-",{"$f":"'wedstr. 11'!F9","v":4},null,"Soasel 1","Gunne 2","Gunne 2","Soasel 1"]
[null,null,null,null,null,null,null,null,null,null,null,null,null,null,0,0,0,0]
[null,null,null,null,null,null,null,null,null,null,null,null,null,null,0,0,0,0]
[null,5,null,null,null,null,null,null,12,null,null,null,null,null,0,0,0,0]
[null,null,null,null,null,null,null,null,null,null,null,null,null,null,0,0,0,0]
[{"$f":"C4","v":"Soasel 2"},"-",{"$f":"C5","v":"Gunne 2"},{"$f":"'wedstr. 5'!D6","v":3},"-",{"$f":"'wedstr. 5'!F6","v":1},null,{"$f":"C5","v":"Gunne 2"},"-",{"$f":"C4","v":"Soasel 2"},{"$f":"'wedstr. 12'!D6","v":1},"-",{"$f":"'wedstr. 12'!F6","v":3},null,"Soasel 2","Gunne 2","Gunne 2","Soasel 2"]
[{"$f":"C8","v":"Gunne 1"},"-",{"$f":"C9","v":"O.Ootmarsum 5"},{"$f":"'wedstr. 5'!D7","v":4},"-",{"$f":"'wedstr. 5'!F7","v":0},null,{"$f":"C9","v":"O.Ootmarsum 5"},"-",{"$f":"C8","v":"Gunne 1"},{"$f":"'wedstr. 12'!D7","v":0},"-",{"$f":"'wedstr. 12'!F7","v":4},null,"Gunne 1","O.Ootmarsum 5",{"$f":"IF($K47+$M47=4,H47,)","v":"O.Ootmarsum 5"},"Gunne 1"]
[{"$f":"C6","v":"O.Ootmarsum 6"},"-",{"$f":"C7","v":"Hertme 4"},{"$f":"'wedstr. 5'!D8","v":3},"-",{"$f":"'wedstr. 5'!F8","v":1},null,{"$f":"C7","v":"Hertme 4"},"-",{"$f":"C6","v":"O.Ootmarsum 6"},{"$f":"'wedstr. 12'!D8","v":3},"-",{"$f":"'wedstr. 12'!F8","v":1},null,"O.Ootmarsum 6","Hertme 4","Hertme 4","O.Ootmarsum 6"]
[{"$f":"C10","v":"Lattr. Brekl. 4"},"-",{"$f":"C11","v":"Soasel 1"},{"$f":"'wedstr. 5'!D9","v":0},"-",{"$f":"'wedstr. 5'!F9","v":4},null,{"$f":"C11","v":"Soasel 1"},"-",{"$f":"C10","v":"Lattr. Brekl. 4"},{"$f":"'wedstr. 12'!D9","v":4},"-",{"$f":"'wedstr. 12'!F9","v":0},null,"Lattr. Brekl. 4","Soasel 1","Soasel 1","Lattr. Brekl. 4"]
[null,null,null,null,null,null,null,null,null,null,null,null,null,null,0,0,0,0]
[null,null,null,null,null,null,null,null,null,null,null,null,null,null,0,0,0,0]
[null,6,null,null,null,null,null,null,13,null,null,null,null,null,0,0,0,0]
[null,null,null,null,null,null,null,null,null,null,null,null,null,null,0,0,0,0]
[{"$f":"C5","v":"Gunne 2"},"-",{"$f":"C6","v":"O.Ootmarsum 6"},{"$f":"'wedstr. 6'!D6","v":4},"-",{"$f":"'wedstr. 6'!F6","v":0},null,{"$f":"C6","v":"O.Ootmarsum 6"},"-",{"$f":"C5","v":"Gunne 2"},{"$f":"'wedstr. 13'!D6","v":4},"-",{"$f":"'wedstr. 13'!F6","v":0},null,"Gunne 2","O.Ootmarsum 6","O.Ootmarsum 6","Gunne 2"]
[{"$f":"C7","v":"Hertme 4"},"-",{"$f":"C4","v":"Soasel 2"},{"$f":"'wedstr. 6'!D7","v":2},"-",{"$f":"'wedstr. 6'!F7","v":2},null,{"$f":"C4","v":"Soasel 2"},"-",{"$f":"C7","v":"Hertme 4"},{"$f":"'wedstr. 13'!D7","v":4},"-",{"$f":"'wedstr. 13'!F7","v":0},null,"Hertme 4","Soasel 2","Soasel 2","Hertme 4"]
[{"$f":"C9","v":"O.Ootmarsum 5"},"-",{"$f":"C10","v":"Lattr. Brekl. 4"},{"$f":"'wedstr. 6'!D8","v":4},"-",{"$f":"'wedstr. 6'!F8","v":0},null,{"$f":"C10","v":"Lattr. Brekl. 4"},"-",{"$f":"C9","v":"O.Ootmarsum 5"},{"$f":"'wedstr. 13'!D8","v":1},"-",{"$f":"'wedstr. 13'!F8","v":3},null,"O.Ootmarsum 5","Lattr. Brekl. 4","Lattr. Brekl. 4","O.Ootmarsum 5"]
[{"$f":"C11","v":"Soasel 1"},"-",{"$f":"C8","v":"Gunne 1"},{"$f":"'wedstr. 6'!D9","v":2},"-",{"$f":"'wedstr. 6'!F9","v":2},null,{"$f":"C8","v":"Gunne 1"},"-",{"$f":"C11","v":"Soasel 1"},{"$f":"'wedstr. 13'!D9","v":3},"-",{"$f":"'wedstr. 13'!F9","v":1},null,"Soasel 1","Gunne 1","Gunne 1","Soasel 1"]
[null,null,null,null,null,null,null,null,null,null,null,null,null,null,0,0,0,0]
[null,null,null,null,null,null,null,null,null,null,null,null,null,null,0,0,0,0]
[null,7,null,null,null,null,null,null,14,null,null,null,null,null,0,0,0,0]
[null,null,null,null,null,null,null,null,null,null,null,null,null,null,0,0,0,0]
[{"$f":"C4","v":"Soasel 2"},"-",{"$f":"C6","v":"O.Ootmarsum 6"},{"$f":"'wedstr. 7'!D6","v":4},"-",{"$f":"'wedstr. 7'!F6","v":0},null,{"$f":"C6","v":"O.Ootmarsum 6"},"-",{"$f":"C4","v":"Soasel 2"},{"$f":"'wedstr. 14'!D6","v":0},"-",{"$f":"'wedstr. 14'!F6","v":4},null,"Soasel 2","O.Ootmarsum 6","O.Ootmarsum 6","Soasel 2"]
[{"$f":"C8","v":"Gunne 1"},"-",{"$f":"C10","v":"Lattr. Brekl. 4"},{"$f":"'wedstr. 7'!D7","v":4},"-",{"$f":"'wedstr. 7'!F7","v":0},null,{"$f":"C10","v":"Lattr. Brekl. 4"},"-",{"$f":"C8","v":"Gunne 1"},{"$f":"'wedstr. 14'!D7","v":0},"-",{"$f":"'wedstr. 14'!F7","v":4},null,"Gunne 1","Lattr. Brekl. 4","Lattr. Brekl. 4","Gunne 1"]
[{"$f":"C9","v":"O.Ootmarsum 5"},"-",{"$f":"C11","v":"Soasel 1"},{"$f":"'wedstr. 7'!D8","v":3},"-",{"$f":"'wedstr. 7'!F8","v":1},null,{"$f":"C11","v":"Soasel 1"},"-",{"$f":"C9","v":"O.Ootmarsum 5"},{"$f":"'wedstr. 14'!D8","v":2},"-",{"$f":"'wedstr. 14'!F8","v":2},null,"O.Ootmarsum 5","Soasel 1","Soasel 1","O.Ootmarsum 5"]
[{"$f":"C7","v":"Hertme 4"},"-",{"$f":"C5","v":"Gunne 2"},{"$f":"'wedstr. 7'!D9","v":0},"-",{"$f":"'wedstr. 7'!F9","v":4},null,{"$f":"C5","v":"Gunne 2"},"-",{"$f":"C7","v":"Hertme 4"},{"$f":"'wedstr. 14'!D9","v":4},"-",{"$f":"'wedstr. 14'!F9","v":0},null,"Hertme 4","Gunne 2","Gunne 2","Hertme 4"]

{"sheet":"2e klasse","index":19,"n_rows":65,"n_cols":18,"rows_kept":65,"cut":false,"hidden":false,"merged":[]}
[null,null,"2e Klasse"]
[null,null,"Team","G",null,"P"]
[]
[null,"A","Brink 4",{"$f":"COUNTIF($O$15:$R$65,C4)","v":14},"-",{"$f":"SUMIF($A$15:$A$65,C4,$D$15:$D$65)+SUMIF($C$15:$C$65,C4,$F$15:$F$65)+SUMIF($H$15:$H$65,C4,$K$15:$K$65)+SUMIF($J$15:$J$65,C4,$M$15:$M$65)","v":24},null,null,null,"Brink 3",{"$f":"COUNTIF($O$15:$R$65,J4)","v":14},"-",{"$f":"SUMIF($A$15:$A$65,J4,$D$15:$D$65)+SUMIF($C$15:$C$65,J4,$F$15:$F$65)+SUMIF($H$15:$H$65,J4,$K$15:$K$65)+SUMIF($J$15:$J$65,J4,$M$15:$M$65)","v":45}]
[null,"B","Wilskracht 3",{"$f":"COUNTIF($O$15:$R$65,C5)","v":14},"-",{"$f":"SUMIF($A$15:$A$65,C5,$D$15:$D$65)+SUMIF($C$15:$C$65,C5,$F$15:$F$65)+SUMIF($H$15:$H$65,C5,$K$15:$K$65)+SUMIF($J$15:$J$65,C5,$M$15:$M$65)","v":26},null,null,null,"Brink 4",14,"-",24]
[null,"C","Soasel 3",14,"-",45,null,null,null,"Gunne 3",14,"-",31]
[null,"D","Hertme 5",14,"-",20,null,null,null,"Hertme 5",14,"-",20]
[null,"E","Gunne 3",14,"-",31,null,null,null,"Hertme 6",14,"-",22]
[null,"F","Soasel 4",14,"-",11,null,null,null,"Soasel 3",14,"-",45]
[null,"G","Hertme 6",14,"-",22,null,null,null,"Soasel 4",14,"-",11]
[null,"H","Brink 3",14,"-",45,null,null,null,"Wilskracht 3",14,"-",26]
[]
[null,1,null,null,null,null,null,null,8]
[]
[{"$f":"C4","v":"Brink 4"},"-",{"$f":"C8","v":"Gunne 3"},{"$f":"'Wedstr. 1'!K6","v":2},"-",{"$f":"'Wedstr. 1'!M6","v":2},null,{"$f":"C8","v":"Gunne 3"},"-",{"$f":"C4","v":"Brink 4"},{"$f":"'wedstr. 8'!K6","v":3},"-",{"$f":"'wedstr. 8'!M6","v":1},null,{"$f":"IF($D15+$F15=4,A15,)","v":"Brink 4"},{"$f":"IF($D15+$F15=4,C15,)","v":"Gunne 3"},{"$f":"IF($K15+$M15=4,H15,)","v":"Gunne 3"},{"$f":"IF($K15+$M15=4,J15,)","v":"Brink 4"}]
[{"$f":"C5","v":"Wilskracht 3"},"-",{"$f":"C9","v":"Soasel 4"},{"$f":"'Wedstr. 1'!K7","v":4},"-",{"$f":"'Wedstr. 1'!M7","v":0},null,{"$f":"C9","v":"Soasel 4"},"-",{"$f":"C5","v":"Wilskracht 3"},{"$f":"'wedstr. 8'!K7","v":1},"-",{"$f":"'wedstr. 8'!M7","v":3},null,{"$f":"IF($D16+$F16=4,A16,)","v":"Wilskracht 3"},{"$f":"IF($D16+$F16=4,C16,)","v":"Soasel 4"},{"$f":"IF($K16+$M16=4,H16,)","v":"Soasel 4"},{"$f":"IF($K16+$M16=4,J16,)","v":"Wilskracht 3"}]
[{"$f":"C6","v":"Soasel 3"},"-",{"$f":"C10","v":"Hertme 6"},{"$f":"'Wedstr. 1'!K8","v":3},"-",{"$f":"'Wedstr. 1'!M8","v":1},null,{"$f":"C10","v":"Hertme 6"},"-",{"$f":"C6","v":"Soasel 3"},{"$f":"'wedstr. 8'!K8","v":1},"-",{"$f":"'wedstr. 8'!M8","v":3},null,"Soasel 3","Hertme 6","Hertme 6","Soasel 3"]
[{"$f":"C7","v":"Hertme 5"},"-",{"$f":"C11","v":"Brink 3"},{"$f":"'Wedstr. 1'!K9","v":0},"-",{"$f":"'Wedstr. 1'!M9","v":4},null,{"$f":"C11","v":"Brink 3"},"-",{"$f":"C7","v":"Hertme 5"},{"$f":"'wedstr. 8'!K9","v":4},"-",{"$f":"'wedstr. 8'!M9","v":0},null,"Hertme 5","Brink 3","Brink 3","Hertme 5"]
[null,null,null,null,null,null,null,null,null,null,null,null,null,null,0,0,0,0]
[null,2,null,null,null,null,null,null,9,null,null,null,null,null,0,0,0,0]
[null,null,null,null,null,null,null,null,null,null,null,null,null,null,0,0,0,0]
[{"$f":"C8","v":"Gunne 3"},"-",{"$f":"C5","v":"Wilskracht 3"},{"$f":"'wedstr. 2'!K6","v":4},"-",{"$f":"'wedstr. 2'!M6","v":0},null,{"$f":"C5","v":"Wilskracht 3"},"-",{"$f":"C8","v":"Gunne 3"},{"$f":"'wedstr. 9'!K6","v":2},"-",{"$f":"'wedstr. 9'!M6","v":2},null,"Gunne 3","Wilskracht 3","Wilskracht 3","Gunne 3"]
[{"$f":"C9","v":"Soasel 4"},"-",{"$f":"C6","v":"Soasel 3"},{"$f":"'wedstr. 2'!K7","v":0},"-",{"$f":"'wedstr. 2'!M7","v":4},null,{"$f":"C6","v":"Soasel 3"},"-",{"$f":"C9","v":"Soasel 4"},{"$f":"'wedstr. 9'!K7","v":4},"-",{"$f":"'wedstr. 9'!M7","v":0},null,"Soasel 4","Soasel 3","Soasel 3","Soasel 4"]
[{"$f":"C10","v":"Hertme 6"},"-",{"$f":"C7","v":"Hertme 5"},{"$f":"'wedstr. 2'!K8","v":2},"-",{"$f":"'wedstr. 2'!M8","v":2},null,{"$f":"C7","v":"Hertme 5"},"-",{"$f":"C10","v":"Hertme 6"},{"$f":"'wedstr. 9'!K8","v":0},"-",{"$f":"'wedstr. 9'!M8","v":4},null,"Hertme 6","Hertme 5","Hertme 5","Hertme 6"]
[{"$f":"C11","v":"Brink 3"},"-",{"$f":"C4","v":"Brink 4"},{"$f":"'wedstr. 2'!K9","v":3},"-",{"$f":"'wedstr. 2'!M9","v":1},null,{"$f":"C4","v":"Brink 4"},"-",{"$f":"C11","v":"Brink 3"},{"$f":"'wedstr. 9'!K9","v":2},"-",{"$f":"'wedstr. 9'!M9","v":2},null,"Brink 3","Brink 4","Brink 4","Brink 3"]
[null,null,null,null,null,null,null,null,null,null,null,null,null,null,0,0,0,0]
[null,null,null,null,null,null,null,null,null,null,null,null,null,null,0,0,0,0]
[null,3,null,null,null,null,null,null,10,null,null,null,null,null,0,0,0,0]
[null,null,null,null,null,null,null,null,null,null,null,null,null,null,0,0,0,0]
[{"$f":"C4","v":"Brink 4"},"-",{"$f":"C9","v":"Soasel 4"},{"$f":"'wedstr. 3'!K6","v":4},"-",{"$f":"'wedstr. 3'!M6","v":0},null,{"$f":"C9","v":"Soasel 4"},"-",{"$f":"C4","v":"Brink 4"},{"$f":"'wedstr. 10'!K6","v":0},"-",{"$f":"'wedstr. 10'!M6","v":4},null,"Brink 4","Soasel 4","Soasel 4","Brink 4"]
[{"$f":"C5","v":"Wilskracht 3"},"-",{"$f":"C10","v":"Hertme 6"},{"$f":"'wedstr. 3'!K7","v":4},"-",{"$f":"'wedstr. 3'!M7","v":0},null,{"$f":"C10","v":"Hertme 6"},"-",{"$f":"C5","v":"Wilskracht 3"},{"$f":"'wedstr. 10'!K7","v":2},"-",{"$f":"'wedstr. 10'!M7","v":2},null,"Wilskracht 3","Hertme 6","Hertme 6","Wilskracht 3"]
[{"$f":"C6","v":"Soasel 3"},"-",{"$f":"C11","v":"Brink 3"},{"$f":"'wedstr. 3'!K8","v":1},"-",{"$f":"'wedstr. 3'!M8","v":3},null,{"$f":"C11","v":"Brink 3"},"-",{"$f":"C6","v":"Soasel 3"},{"$f":"'wedstr. 10'!K8","v":3},"-",{"$f":"'wedstr. 10'!M8","v":1},null,"Soasel 3","Brink 3","Brink 3","Soasel 3"]
[{"$f":"C7","v":"Hertme 5"},"-",{"$f":"C8","v":"Gunne 3"},{"$f":"'wedstr. 3'!K9","v":3},"-",{"$f":"'wedstr. 3'!M9","v":1},null,{"$f":"C8","v":"Gunne 3"},"-",{"$f":"C7","v":"Hertme 5"},{"$f":"'wedstr. 10'!K9","v":4},"-",{"$f":"'wedstr. 10'!M9","v":0},null,"Hertme 5","Gunne 3","Gunne 3","Hertme 5"]
[null,null,null,null,null,null,null,null,null,null,null,null,null,null,0,0,0,0]
[null,null,null,null,null,null,null,null,null,null,null,null,null,null,0,0,0,0]
[null,4,null,null,null,null,null,null,11,null,null,null,null,null,0,0,0,0]
[null,null,null,null,null,null,null,null,null,null,null,null,null,null,0,0,0,0]
[{"$f":"C8","v":"Gunne 3"},"-",{"$f":"C6","v":"Soasel 3"},{"$f":"'wedstr. 4'!K6","v":0},"-",{"$f":"'wedstr. 4'!M6","v":4},null,{"$f":"C6","v":"Soasel 3"},"-",{"$f":"C8","v":"Gunne 3"},{"$f":"'wedstr. 11'!K6","v":4},"-",{"$f":"'wedstr. 11'!M6","v":0},null,"Gunne 3","Soasel 3","Soasel 3","Gunne 3"]
[{"$f":"C9","v":"Soasel 4"},"-",{"$f":"C7","v":"Hertme 5"},{"$f":"'wedstr. 4'!K7","v":2},"-",{"$f":"'wedstr. 4'!M7","v":2},null,{"$f":"C7","v":"Hertme 5"},"-",{"$f":"C9","v":"Soasel 4"},{"$f":"'wedstr. 11'!K7","v":1},"-",{"$f":"'wedstr. 11'!M7","v":3},null,"Soasel 4","Hertme 5","Hertme 5","Soasel 4"]
[{"$f":"C10","v":"Hertme 6"},"-",{"$f":"C4","v":"Brink 4"},{"$f":"'wedstr. 4'!K8","v":2},"-",{"$f":"'wedstr. 4'!M8","v":2},null,{"$f":"C4","v":"Brink 4"},"-",{"$f":"C10","v":"Hertme 6"},{"$f":"'wedstr. 11'!K8","v":2},"-",{"$f":"'wedstr. 11'!M8","v":2},null,"Hertme 6","Brink 4","Brink 4","Hertme 6"]
[{"$f":"C11","v":"Brink 3"},"-",{"$f":"C5","v":"Wilskracht 3"},{"$f":"'wedstr. 4'!K9","v":3},"-",{"$f":"'wedstr. 4'!M9","v":1},null,{"$f":"C5","v":"Wilskracht 3"},"-",{"$f":"C11","v":"Brink 3"},{"$f":"'wedstr. 11'!K9","v":1},"-",{"$f":"'wedstr. 11'!M9","v":3},null,"Brink 3","Wilskracht 3","Wilskracht 3","Brink 3"]
[null,null,null,null,null,null,null,null,null,null,null,null,null,null,0,0,0,0]
[null,null,null,null,null,null,null,null,null,null,null,null,null,null,0,0,0,0]
[null,5,null,null,null,null,null,null,12,null,null,null,null,null,0,0,0,0]
[null,null,null,null,null,null,null,null,null,null,null,null,null,null,0,0,0,0]
[{"$f":"C4","v":"Brink 4"},"-",{"$f":"C5","v":"Wilskracht 3"},{"$f":"'wedstr. 5'!K6","v":0},"-",{"$f":"'wedstr. 5'!M6","v":4},null,{"$f":"C5","v":"Wilskracht 3"},"-",{"$f":"C4","v":"Brink 4"},{"$f":"'wedstr. 12'!K6","v":0},"-",{"$f":"'wedstr. 12'!M6","v":4},null,"Brink 4","Wilskracht 3","Wilskracht 3","Brink 4"]
[{"$f":"C8","v":"Gunne 3"},"-",{"$f":"C9","v":"Soasel 4"},{"$f":"'wedstr. 5'!K7","v":3},"-",{"$f":"'wedstr. 5'!M7","v":1},null,{"$f":"C9","v":"Soasel 4"},"-",{"$f":"C8","v":"Gunne 3"},{"$f":"'wedstr. 12'!K7","v":2},"-",{"$f":"'wedstr. 12'!M7","v":2},null,"Gunne 3","Soasel 4","Soasel 4","Gunne 3"]
[{"$f":"C6","v":"Soasel 3"},"-",{"$f":"C7","v":"Hertme 5"},{"$f":"'wedstr. 5'!K8","v":4},"-",{"$f":"'wedstr. 5'!M8","v":0},null,{"$f":"C7","v":"Hertme 5"},"-",{"$f":"C6","v":"Soasel 3"},{"$f":"'wedstr. 12'!K8","v":0},"-",{"$f":"'wedstr. 12'!M8","v":4},null,"Soasel 3","Hertme 5","Hertme 5","Soasel 3"]
[{"$f":"C10","v":"Hertme 6"},"-",{"$f":"C11","v":"Brink 3"},{"$f":"'wedstr. 5'!K9","v":1},"-",{"$f":"'wedstr. 5'!M9","v":3},null,{"$f":"C11","v":"Brink 3"},"-",{"$f":"C10","v":"Hertme 6"},{"$f":"'wedstr. 12'!K9","v":4},"-",{"$f":"'wedstr. 12'!M9","v":0},null,"Hertme 6","Brink 3","Brink 3","Hertme 6"]
[null,null,null,null,null,null,null,null,null,null,null,null,null,null,0,0,0,0]
[null,null,null,null,null,null,null,null,null,null,null,null,null,null,0,0,0,0]
[null,6,null,null,null,null,null,null,13,null,null,null,null,null,0,0,0,0]
[null,null,null,null,null,null,null,null,null,null,null,null,null,null,0,0,0,0]
[{"$f":"C5","v":"Wilskracht 3"},"-",{"$f":"C6","v":"Soasel 3"},{"$f":"'wedstr. 6'!K6","v":1},"-",{"$f":"'wedstr. 6'!M6","v":3},null,{"$f":"C6","v":"Soasel 3"},"-",{"$f":"C5","v":"Wilskracht 3"},{"$f":"'wedstr. 13'!K6","v":4},"-",{"$f":"'wedstr. 13'!M6","v":0},null,"Wilskracht 3","Soasel 3","Soasel 3","Wilskracht 3"]
[{"$f":"C7","v":"Hertme 5"},"-",{"$f":"C4","v":"Brink 4"},{"$f":"'wedstr. 6'!K7","v":4},"-",{"$f":"'wedstr. 6'!M7","v":0},null,{"$f":"C4","v":"Brink 4"},"-",{"$f":"C7","v":"Hertme 5"},{"$f":"'wedstr. 13'!K7","v":0},"-",{"$f":"'wedstr. 13'!M7","v":4},null,"Hertme 5","Brink 4","Brink 4","Hertme 5"]
[{"$f":"C9","v":"Soasel 4"},"-",{"$f":"C10","v":"Hertme 6"},{"$f":"'wedstr. 6'!K8","v":1},"-",{"$f":"'wedstr. 6'!M8","v":3},null,{"$f":"C10","v":"Hertme 6"},"-",{"$f":"C9","v":"Soasel 4"},{"$f":"'wedstr. 13'!K8","v":4},"-",{"$f":"'wedstr. 13'!M8","v":0},null,"Soasel 4","Hertme 6","Hertme 6","Soasel 4"]
[{"$f":"C11","v":"Brink 3"},"-",{"$f":"C8","v":"Gunne 3"},{"$f":"'wedstr. 6'!K9","v":2},"-",{"$f":"'wedstr. 6'!M9","v":2},null,{"$f":"C8","v":"Gunne 3"},"-",{"$f":"C11","v":"Brink 3"},{"$f":"'wedstr. 13'!K9","v":0},"-",{"$f":"'wedstr. 13'!M9","v":4},null,"Brink 3","Gunne 3","Gunne 3","Brink 3"]
[null,null,null,null,null,null,null,null,null,null,null,null,null,null,0,0,0,0]
[null,null,null,null,null,null,null,null,null,null,null,null,null,null,0,0,0,0]
[null,7,null,null,null,null,null,null,14,null,null,null,null,null,0,0,0,0]
[null,null,null,null,null,null,null,null,null,null,null,null,null,null,0,0,0,0]
[{"$f":"C4","v":"Brink 4"},"-",{"$f":"C6","v":"Soasel 3"},{"$f":"'wedstr. 7'!K6","v":0},"-",{"$f":"'wedstr. 7'!M6","v":4},null,{"$f":"C6","v":"Soasel 3"},"-",{"$f":"C4","v":"Brink 4"},{"$f":"'wedstr. 14'!K6","v":2},"-",{"$f":"'wedstr. 14'!M6","v":2},null,"Brink 4","Soasel 3","Soasel 3","Brink 4"]
[{"$f":"C8","v":"Gunne 3"},"-",{"$f":"C10","v":"Hertme 6"},{"$f":"'wedstr. 7'!K7","v":4},"-",{"$f":"'wedstr. 7'!M7","v":0},null,{"$f":"C10","v":"Hertme 6"},"-",{"$f":"C8","v":"Gunne 3"},{"$f":"'wedstr. 14'!K7","v":0},"-",{"$f":"'wedstr. 14'!M7","v":4},null,"Gunne 3","Hertme 6","Hertme 6","Gunne 3"]
[{"$f":"C9","v":"Soasel 4"},"-",{"$f":"C11","v":"Brink 3"},{"$f":"'wedstr. 7'!K8","v":0},"-",{"$f":"'wedstr. 7'!M8","v":4},null,{"$f":"C11","v":"Brink 3"},"-",{"$f":"C9","v":"Soasel 4"},{"$f":"'wedstr. 14'!K8","v":3},"-",{"$f":"'wedstr. 14'!M8","v":1},null,"Soasel 4","Brink 3","Brink 3","Soasel 4"]
[{"$f":"C7","v":"Hertme 5"},"-",{"$f":"C5","v":"Wilskracht 3"},{"$f":"'wedstr. 7'!K9","v":0},"-",{"$f":"'wedstr. 7'!M9","v":4},null,{"$f":"C5","v":"Wilskracht 3"},"-",{"$f":"C7","v":"Hertme 5"},{"$f":"'wedstr. 14'!K9","v":0},"-",{"$f":"'wedstr. 14'!M9","v":4},null,"Hertme 5","Wilskracht 3","Wilskracht 3","Hertme 5"]

{"sheet":"3e klasse","index":20,"n_rows":65,"n_cols":18,"rows_kept":65,"cut":false,"hidden":false,"merged":[]}
[null,null,"3e Klasse"]
[null,null,"Team","G",null,"P"]
[]
[null,"A","Soasel 5",{"$f":"COUNTIF($O$15:$R$65,C4)","v":12},"-",{"$f":"SUMIF($A$15:$A$65,C4,$D$15:$D$65)+SUMIF($C$15:$C$65,C4,$F$15:$F$65)+SUMIF($H$15:$H$65,C4,$K$15:$K$65)+SUMIF($J$15:$J$65,C4,$M$15:$M$65)","v":24},null,null,null,"Gunne 4",{"$f":"COUNTIF($O$15:$R$65,J4)","v":12},"-",{"$f":"SUMIF($A$15:$A$65,J4,$D$15:$D$65)+SUMIF($C$15:$C$65,J4,$F$15:$F$65)+SUMIF($H$15:$H$65,J4,$K$15:$K$65)+SUMIF($J$15:$J$65,J4,$M$15:$M$65)","v":23}]
[null,"B","Gunne 4",{"$f":"COUNTIF($O$15:$R$65,C5)","v":12},"-",{"$f":"SUMIF($A$15:$A$65,C5,$D$15:$D$65)+SUMIF($C$15:$C$65,C5,$F$15:$F$65)+SUMIF($H$15:$H$65,C5,$K$15:$K$65)+SUMIF($J$15:$J$65,C5,$M$15:$M$65)","v":23},null,null,null,"H.K.V. 1",12,"-",15]
[null,"C","Nijstad 3",12,"-",20,null,null,null,"Lattr. Brekl. 5",12,"-",38]
[null,"D","Lattr. Brekl. 5",12,"-",38,null,null,null,"Nijstad 2",12,"-",21]
[null,"E","vrij",0,"-",0,null,null,null,"Nijstad 3",12,"-",20]
[null,"F","Nijstad 2",12,"-",21,null,null,null,"Soasel 5",12,"-",24]
[null,"G","H.K.V. 1",12,"-",15,null,null,null,"vrij",0,"-",0]
[null,"H","Wilskracht 4",12,"-",27,null,null,null,"Wilskracht 4",12,"-",27]
[]
[null,1,null,null,null,null,null,null,8]
[]
[{"$f":"C4","v":"Soasel 5"},"-",{"$f":"C8","v":"vrij"},{"$f":"'Wedstr. 1'!D13","v":0},"-",{"$f":"'Wedstr. 1'!F13","v":0},null,{"$f":"C8","v":"vrij"},"-",{"$f":"C4","v":"Soasel 5"},{"$f":"'wedstr. 8'!D13","v":0},"-",{"$f":"'wedstr. 8'!F13","v":0},null,{"$f":"IF($D15+$F15=4,A15,)","v":0},{"$f":"IF($D15+$F15=4,C15,)","v":0},{"$f":"IF($K15+$M15=4,H15,)","v":0},{"$f":"IF($K15+$M15=4,J15,)","v":0}]
[{"$f":"C5","v":"Gunne 4"},"-",{"$f":"C9","v":"Nijstad 2"},{"$f":"'Wedstr. 1'!D14","v":3},"-",{"$f":"'Wedstr. 1'!F14","v":1},null,{"$f":"C9","v":"Nijstad 2"},"-",{"$f":"C5","v":"Gunne 4"},{"$f":"'wedstr. 8'!D14","v":2},"-",{"$f":"'wedstr. 8'!F14","v":2},null,{"$f":"IF($D16+$F16=4,A16,)","v":"Gunne 4"},{"$f":"IF($D16+$F16=4,C16,)","v":"Nijstad 2"},{"$f":"IF($K16+$M16=4,H16,)","v":"Nijstad 2"},{"$f":"IF($K16+$M16=4,J16,)","v":"Gunne 4"}]
[{"$f":"C6","v":"Nijstad 3"},"-",{"$f":"C10","v":"H.K.V. 1"},{"$f":"'Wedstr. 1'!D15","v":4},"-",{"$f":"'Wedstr. 1'!F15","v":0},null,{"$f":"C10","v":"H.K.V. 1"},"-",{"$f":"C6","v":"Nijstad 3"},{"$f":"'wedstr. 8'!D15","v":1},"-",{"$f":"'wedstr. 8'!F15","v":3},null,"Nijstad 3","H.K.V. 1","H.K.V. 1","Nijstad 3"]
[{"$f":"C7","v":"Lattr. Brekl. 5"},"-",{"$f":"C11","v":"Wilskracht 4"},{"$f":"'Wedstr. 1'!D16","v":4},"-",{"$f":"'Wedstr. 1'!F16","v":0},null,{"$f":"C11","v":"Wilskracht 4"},"-",{"$f":"C7","v":"Lattr. Brekl. 5"},{"$f":"'wedstr. 8'!D16","v":1},"-",{"$f":"'wedstr. 8'!F16","v":3},null,"Lattr. Brekl. 5","Wilskracht 4","Wilskracht 4","Lattr. Brekl. 5"]
[null,null,null,null,null,null,null,null,null,null,null,null,null,null,0,0,0,0]
[null,2,null,null,null,null,null,null,9,null,null,null,null,null,0,0,0,0]
[null,null,null,null,null,null,null,null,null,null,null,null,null,null,0,0,0,0]
[{"$f":"C8","v":"vrij"},"-",{"$f":"C5","v":"Gunne 4"},{"$f":"'wedstr. 2'!D13","v":0},"-",{"$f":"'wedstr. 2'!F13","v":0},null,{"$f":"C5","v":"Gunne 4"},"-",{"$f":"C8","v":"vrij"},{"$f":"'wedstr. 9'!D13","v":0},"-",{"$f":"'wedstr. 9'!F13","v":0},null,0,0,0,0]
[{"$f":"C9","v":"Nijstad 2"},"-",{"$f":"C6","v":"Nijstad 3"},{"$f":"'wedstr. 2'!D14","v":4},"-",{"$f":"'wedstr. 2'!F14","v":0},null,{"$f":"C6","v":"Nijstad 3"},"-",{"$f":"C9","v":"Nijstad 2"},{"$f":"'wedstr. 9'!D14","v":2},"-",{"$f":"'wedstr. 9'!F14","v":2},null,"Nijstad 2","Nijstad 3","Nijstad 3","Nijstad 2"]
[{"$f":"C10","v":"H.K.V. 1"},"-",{"$f":"C7","v":"Lattr. Brekl. 5"},{"$f":"'wedstr. 2'!D15","v":0},"-",{"$f":"'wedstr. 2'!F15","v":4},null,{"$f":"C7","v":"Lattr. Brekl. 5"},"-",{"$f":"C10","v":"H.K.V. 1"},{"$f":"'wedstr. 9'!D15","v":4},"-",{"$f":"'wedstr. 9'!F15","v":0},null,"H.K.V. 1","Lattr. Brekl. 5","Lattr. Brekl. 5","H.K.V. 1"]
[{"$f":"C11","v":"Wilskracht 4"},"-",{"$f":"C4","v":"Soasel 5"},{"$f":"'wedstr. 2'!D16","v":0},"-",{"$f":"'wedstr. 2'!F16","v":4},null,{"$f":"C4","v":"Soasel 5"},"-",{"$f":"C11","v":"Wilskracht 4"},{"$f":"'wedstr. 9'!D16","v":2},"-",{"$f":"'wedstr. 9'!F16","v":2},null,"Wilskracht 4","Soasel 5","Soasel 5","Wilskracht 4"]
[null,null,null,null,null,null,null,null,null,null,null,null,null,null,0,0,0,0]
[null,null,null,null,null,null,null,null,null,null,null,null,null,null,0,0,0,0]
[null,3,null,null,null,null,null,null,10,null,null,null,null,null,0,0,0,0]
[null,null,null,null,null,null,null,null,null,null,null,null,null,null,0,0,0,0]
[{"$f":"C4","v":"Soasel 5"},"-",{"$f":"C9","v":"Nijstad 2"},{"$f":"'wedstr. 3'!D13","v":4},"-",{"$f":"'wedstr. 3'!F13","v":0},null,{"$f":"C9","v":"Nijstad 2"},"-",{"$f":"C4","v":"Soasel 5"},{"$f":"'wedstr. 10'!D13","v":4},"-",{"$f":"'wedstr. 10'!F13","v":0},null,"Soasel 5","Nijstad 2","Nijstad 2","Soasel 5"]
[{"$f":"C5","v":"Gunne 4"},"-",{"$f":"C10","v":"H.K.V. 1"},{"$f":"'wedstr. 3'!D14","v":2},"-",{"$f":"'wedstr. 3'!F14","v":2},null,{"$f":"C10","v":"H.K.V. 1"},"-",{"$f":"C5","v":"Gunne 4"},{"$f":"'wedstr. 10'!D14","v":2},"-",{"$f":"'wedstr. 10'!F14","v":2},null,"Gunne 4","H.K.V. 1","H.K.V. 1","Gunne 4"]
[{"$f":"C6","v":"Nijstad 3"},"-",{"$f":"C11","v":"Wilskracht 4"},{"$f":"'wedstr. 3'!D15","v":0},"-",{"$f":"'wedstr. 3'!F15","v":4},null,{"$f":"C11","v":"Wilskracht 4"},"-",{"$f":"C6","v":"Nijstad 3"},{"$f":"'wedstr. 10'!D15","v":4},"-",{"$f":"'wedstr. 10'!F15","v":0},null,"Nijstad 3","Wilskracht 4","Wilskracht 4","Nijstad 3"]
[{"$f":"C7","v":"Lattr. Brekl. 5"},"-",{"$f":"C8","v":"vrij"},{"$f":"'wedstr. 3'!D16","v":0},"-",{"$f":"'wedstr. 3'!F16","v":0},null,{"$f":"C8","v":"vrij"},"-",{"$f":"C7","v":"Lattr. Brekl. 5"},{"$f":"'wedstr. 10'!D16","v":0},"-",{"$f":"'wedstr. 10'!F16","v":0},null,0,0,0,0]
[null,null,null,null,null,null,null,null,null,null,null,null,null,null,0,0,0,0]
[null,null,null,null,null,null,null,null,null,null,null,null,null,null,0,0,0,0]
[null,4,null,null,null,null,null,null,11,null,null,null,null,null,0,0,0,0]
[null,null,null,null,null,null,null,null,null,null,null,null,null,null,0,0,0,0]
[{"$f":"C8","v":"vrij"},"-",{"$f":"C6","v":"Nijstad 3"},{"$f":"'wedstr. 4'!D13","v":0},"-",{"$f":"'wedstr. 4'!F13","v":0},null,{"$f":"C6","v":"Nijstad 3"},"-",{"$f":"C8","v":"vrij"},{"$f":"'wedstr. 11'!D13","v":0},"-",{"$f":"'wedstr. 11'!F13","v":0},null,0,0,0,0]
[{"$f":"C9","v":"Nijstad 2"},"-",{"$f":"C7","v":"Lattr. Brekl. 5"},{"$f":"'wedstr. 4'!D14","v":2},"-",{"$f":"'wedstr. 4'!F14","v":2},null,{"$f":"C7","v":"Lattr. Brekl. 5"},"-",{"$f":"C9","v":"Nijstad 2"},{"$f":"'wedstr. 11'!D14","v":4},"-",{"$f":"'wedstr. 11'!F14","v":0},null,"Nijstad 2","Lattr. Brekl. 5","Lattr. Brekl. 5","Nijstad 2"]
[{"$f":"C10","v":"H.K.V. 1"},"-",{"$f":"C4","v":"Soasel 5"},{"$f":"'wedstr. 4'!D15","v":1},"-",{"$f":"'wedstr. 4'!F15","v":3},null,{"$f":"C4","v":"Soasel 5"},"-",{"$f":"C10","v":"H.K.V. 1"},{"$f":"'wedstr. 11'!D15","v":2},"-",{"$f":"'wedstr. 11'!F15","v":2},null,"H.K.V. 1","Soasel 5","Soasel 5","H.K.V. 1"]
[{"$f":"C11","v":"Wilskracht 4"},"-",{"$f":"C5","v":"Gunne 4"},{"$f":"'wedstr. 4'!D16","v":3},"-",{"$f":"'wedstr. 4'!F16","v":1},null,{"$f":"C5","v":"Gunne 4"},"-",{"$f":"C11","v":"Wilskracht 4"},{"$f":"'wedstr. 11'!D16","v":2},"-",{"$f":"'wedstr. 11'!F16","v":2},null,"Wilskracht 4","Gunne 4","Gunne 4","Wilskracht 4"]
[null,null,null,null,null,null,null,null,null,null,null,null,null,null,0,0,0,0]
[null,null,null,null,null,null,null,null,null,null,null,null,null,null,0,0,0,0]
[null,5,null,null,null,null,null,null,12,null,null,null,null,null,0,0,0,0]
[null,null,null,null,null,null,null,null,null,null,null,null,null,null,0,0,0,0]
[{"$f":"C4","v":"Soasel 5"},"-",{"$f":"C5","v":"Gunne 4"},{"$f":"'wedstr. 5'!D13","v":1},"-",{"$f":"'wedstr. 5'!F13","v":3},null,{"$f":"C5","v":"Gunne 4"},"-",{"$f":"C4","v":"Soasel 5"},{"$f":"'wedstr. 12'!D13","v":2},"-",{"$f":"'wedstr. 12'!F13","v":2},null,"Soasel 5","Gunne 4","Gunne 4","Soasel 5"]
[{"$f":"C8","v":"vrij"},"-",{"$f":"C9","v":"Nijstad 2"},{"$f":"'wedstr. 5'!D14","v":0},"-",{"$f":"'wedstr. 5'!F14","v":0},null,{"$f":"C9","v":"Nijstad 2"},"-",{"$f":"C8","v":"vrij"},{"$f":"'wedstr. 12'!D14","v":0},"-",{"$f":"'wedstr. 12'!F14","v":0},null,0,0,0,0]
[{"$f":"C6","v":"Nijstad 3"},"-",{"$f":"C7","v":"Lattr. Brekl. 5"},{"$f":"'wedstr. 5'!D15","v":0},"-",{"$f":"'wedstr. 5'!F15","v":4},null,{"$f":"C7","v":"Lattr. Brekl. 5"},"-",{"$f":"C6","v":"Nijstad 3"},{"$f":"'wedstr. 12'!D15","v":3},"-",{"$f":"'wedstr. 12'!F15","v":1},null,"Nijstad 3","Lattr. Brekl. 5","Lattr. Brekl. 5","Nijstad 3"]
[{"$f":"C10","v":"H.K.V. 1"},"-",{"$f":"C11","v":"Wilskracht 4"},{"$f":"'wedstr. 5'!D16","v":2},"-",{"$f":"'wedstr. 5'!F16","v":2},null,{"$f":"C11","v":"Wilskracht 4"},"-",{"$f":"C10","v":"H.K.V. 1"},{"$f":"'wedstr. 12'!D16","v":4},"-",{"$f":"'wedstr. 12'!F16","v":0},null,"H.K.V. 1","Wilskracht 4","Wilskracht 4","H.K.V. 1"]
[null,null,null,null,null,null,null,null,null,null,null,null,null,null,0,0,0,0]
[null,null,null,null,null,null,null,null,null,null,null,null,null,null,0,0,0,0]
[null,6,null,null,null,null,null,null,13,null,null,null,null,null,0,0,0,0]
[null,null,null,null,null,null,null,null,null,null,null,null,null,null,0,0,0,0]
[{"$f":"C5","v":"Gunne 4"},"-",{"$f":"C6","v":"Nijstad 3"},{"$f":"'wedstr. 6'!D13","v":4},"-",{"$f":"'wedstr. 6'!F13","v":0},null,{"$f":"C6","v":"Nijstad 3"},"-",{"$f":"C5","v":"Gunne 4"},{"$f":"'wedstr. 13'!D13","v":4},"-",{"$f":"'wedstr. 13'!F13","v":0},null,"Gunne 4","Nijstad 3","Nijstad 3","Gunne 4"]
[{"$f":"C7","v":"Lattr. Brekl. 5"},"-",{"$f":"C4","v":"Soasel 5"},{"$f":"'wedstr. 6'!D14","v":4},"-",{"$f":"'wedstr. 6'!F14","v":0},null,{"$f":"C4","v":"Soasel 5"},"-",{"$f":"C7","v":"Lattr. Brekl. 5"},{"$f":"'wedstr. 13'!D14","v":4},"-",{"$f":"'wedstr. 13'!F14","v":0},null,"Lattr. Brekl. 5","Soasel 5","Soasel 5","Lattr. Brekl. 5"]
[{"$f":"C9","v":"Nijstad 2"},"-",{"$f":"C10","v":"H.K.V. 1"},{"$f":"'wedstr. 6'!D15","v":3},"-",{"$f":"'wedstr. 6'!F15","v":1},null,{"$f":"C10","v":"H.K.V. 1"},"-",{"$f":"C9","v":"Nijstad 2"},{"$f":"'wedstr. 13'!D15","v":4},"-",{"$f":"'wedstr. 13'!F15","v":0},null,"Nijstad 2","H.K.V. 1","H.K.V. 1","Nijstad 2"]
[{"$f":"C11","v":"Wilskracht 4"},"-",{"$f":"C8","v":"vrij"},{"$f":"'wedstr. 6'!D16","v":0},"-",{"$f":"'wedstr. 6'!F16","v":0},null,{"$f":"C8","v":"vrij"},"-",{"$f":"C11","v":"Wilskracht 4"},{"$f":"'wedstr. 13'!D16","v":0},"-",{"$f":"'wedstr. 13'!F16","v":0},null,0,0,0,0]
[null,null,null,null,null,null,null,null,null,null,null,null,null,null,0,0,0,0]
[null,null,null,null,null,null,null,null,null,null,null,null,null,null,0,0,0,0]
[null,7,null,null,null,null,null,null,14,null,null,null,null,null,0,0,0,0]
[null,null,null,null,null,null,null,null,null,null,null,null,null,null,0,0,0,0]
[{"$f":"C4","v":"Soasel 5"},"-",{"$f":"C6","v":"Nijstad 3"},{"$f":"'wedstr. 7'!D13","v":2},"-",{"$f":"'wedstr. 7'!F13","v":2},null,{"$f":"C6","v":"Nijstad 3"},"-",{"$f":"C4","v":"Soasel 5"},{"$f":"'wedstr. 14'!D13","v":4},"-",{"$f":"'wedstr. 14'!F13","v":0},null,"Soasel 5","Nijstad 3","Nijstad 3","Soasel 5"]
[{"$f":"C8","v":"vrij"},"-",{"$f":"C10","v":"H.K.V. 1"},{"$f":"'wedstr. 7'!D14","v":0},"-",{"$f":"'wedstr. 7'!F14","v":0},null,{"$f":"C10","v":"H.K.V. 1"},"-",{"$f":"C8","v":"vrij"},{"$f":"'wedstr. 14'!D14","v":0},"-",{"$f":"'wedstr. 14'!F14","v":0},null,0,0,0,0]
[{"$f":"C9","v":"Nijstad 2"},"-",{"$f":"C11","v":"Wilskracht 4"},{"$f":"'wedstr. 7'!D15","v":3},"-",{"$f":"'wedstr. 7'!F15","v":1},null,{"$f":"C11","v":"Wilskracht 4"},"-",{"$f":"C9","v":"Nijstad 2"},{"$f":"'wedstr. 14'!D15","v":4},"-",{"$f":"'wedstr. 14'!F15","v":0},null,"Nijstad 2","Wilskracht 4","Wilskracht 4","Nijstad 2"]
[{"$f":"C7","v":"Lattr. Brekl. 5"},"-",{"$f":"C5","v":"Gunne 4"},{"$f":"'wedstr. 7'!D16","v":2},"-",{"$f":"'wedstr. 7'!F16","v":2},null,{"$f":"C5","v":"Gunne 4"},"-",{"$f":"C7","v":"Lattr. Brekl. 5"},{"$f":"'wedstr. 14'!D16","v":0},"-",{"$f":"'wedstr. 14'!F16","v":4},null,"Lattr. Brekl. 5","Gunne 4","Gunne 4","Lattr. Brekl. 5"]

{"sheet":"4e klasse","index":21,"n_rows":65,"n_cols":18,"rows_kept":65,"cut":false,"hidden":false,"merged":[]}
[null,null,"4e Klasse"]
[null,null,"Team","G",null,"P"]
[]
[null,"A","vrij",{"$f":"COUNTIF($O$15:$R$65,C4)","v":0},"-",{"$f":"SUMIF($A$15:$A$65,C4,$D$15:$D$65)+SUMIF($C$15:$C$65,C4,$F$15:$F$65)+SUMIF($H$15:$H$65,C4,$K$15:$K$65)+SUMIF($J$15:$J$65,C4,$M$15:$M$65)","v":0},null,null,null,"Hertme 7",{"$f":"COUNTIF($O$15:$R$65,J4)","v":12},"-",{"$f":"SUMIF($A$15:$A$65,J4,$D$15:$D$65)+SUMIF($C$15:$C$65,J4,$F$15:$F$65)+SUMIF($H$15:$H$65,J4,$K$15:$K$65)+SUMIF($J$15:$J$65,J4,$M$15:$M$65)","v":4}]
[null,"B","Lattr. Brekl. 6",{"$f":"COUNTIF($O$15:$R$65,C5)","v":12},"-",{"$f":"SUMIF($A$15:$A$65,C5,$D$15:$D$65)+SUMIF($C$15:$C$65,C5,$F$15:$F$65)+SUMIF($H$15:$H$65,C5,$K$15:$K$65)+SUMIF($J$15:$J$65,C5,$M$15:$M$65)","v":25},null,null,null,"Hertme 8",12,"-",24]
[null,"C","O.Ootmarsum 8",12,"-",44,null,null,null,"Lattr. Brekl. 6",12,"-",25]
[null,"D","Hertme 8",12,"-",24,null,null,null,"Lattr. Brekl. 7",12,"-",21]
[null,"E","Lattr. Brekl. 7",12,"-",21,null,null,null,"O.Ootmarsum 7",12,"-",36]
[null,"F","O.Ootmarsum 7",12,"-",36,null,null,null,"O.Ootmarsum 8",12,"-",44]
[null,"G","Hertme 7",12,"-",4,null,null,null,"Soasel 6",12,"-",14]
[null,"H","Soasel 6",12,"-",14,null,null,null,"vrij",0,"-",0]
[]
[null,1,null,null,null,null,null,null,8]
[]
[{"$f":"C4","v":"vrij"},"-",{"$f":"C8","v":"Lattr. Brekl. 7"},{"$f":"'Wedstr. 1'!K13","v":0},"-",{"$f":"'Wedstr. 1'!M13","v":0},null,{"$f":"C8","v":"Lattr. Brekl. 7"},"-",{"$f":"C4","v":"vrij"},{"$f":"'wedstr. 8'!K13","v":0},"-",{"$f":"'wedstr. 8'!M13","v":0},null,{"$f":"IF($D15+$F15=4,A15,)","v":0},{"$f":"IF($D15+$F15=4,C15,)","v":0},{"$f":"IF($K15+$M15=4,H15,)","v":0},{"$f":"IF($K15+$M15=4,J15,)","v":0}]
[{"$f":"C5","v":"Lattr. Brekl. 6"},"-",{"$f":"C9","v":"O.Ootmarsum 7"},{"$f":"'Wedstr. 1'!K14","v":0},"-",{"$f":"'Wedstr. 1'!M14","v":4},null,{"$f":"C9","v":"O.Ootmarsum 7"},"-",{"$f":"C5","v":"Lattr. Brekl. 6"},{"$f":"'wedstr. 8'!K14","v":3},"-",{"$f":"'wedstr. 8'!M14","v":1},null,{"$f":"IF($D16+$F16=4,A16,)","v":"Lattr. Brekl. 6"},{"$f":"IF($D16+$F16=4,C16,)","v":"O.Ootmarsum 7"},{"$f":"IF($K16+$M16=4,H16,)","v":"O.Ootmarsum 7"},{"$f":"IF($K16+$M16=4,J16,)","v":"Lattr. Brekl. 6"}]
[{"$f":"C6","v":"O.Ootmarsum 8"},"-",{"$f":"C10","v":"Hertme 7"},{"$f":"'Wedstr. 1'!K15","v":4},"-",{"$f":"'Wedstr. 1'!M15","v":0},null,{"$f":"C10","v":"Hertme 7"},"-",{"$f":"C6","v":"O.Ootmarsum 8"},{"$f":"'wedstr. 8'!K15","v":0},"-",{"$f":"'wedstr. 8'!M15","v":4},null,"O.Ootmarsum 8","Hertme 7","Hertme 7","O.Ootmarsum 8"]
[{"$f":"C7","v":"Hertme 8"},"-",{"$f":"C11","v":"Soasel 6"},{"$f":"'Wedstr. 1'!K16","v":3},"-",{"$f":"'Wedstr. 1'!M16","v":1},null,{"$f":"C11","v":"Soasel 6"},"-",{"$f":"C7","v":"Hertme 8"},{"$f":"'wedstr. 8'!K16","v":0},"-",{"$f":"'wedstr. 8'!M16","v":4},null,"Hertme 8","Soasel 6","Soasel 6","Hertme 8"]
[null,null,null,null,null,null,null,null,null,null,null,null,null,null,0,0,0,0]
[null,2,null,null,null,null,null,null,9,null,null,null,null,null,0,0,0,0]
[null,null,null,null,null,null,null,null,null,null,null,null,null,null,0,0,0,0]
[{"$f":"C8","v":"Lattr. Brekl. 7"},"-",{"$f":"C5","v":"Lattr. Brekl. 6"},{"$f":"'wedstr. 2'!K13","v":0},{"$f":"'wedstr. 2'!L13","v":"-"},{"$f":"'wedstr. 2'!M13","v":4},null,{"$f":"C5","v":"Lattr. Brekl. 6"},"-",{"$f":"C8","v":"Lattr. Brekl. 7"},{"$f":"'wedstr. 9'!K13","v":2},"-",{"$f":"'wedstr. 9'!M13","v":2},null,"Lattr. Brekl. 7","Lattr. Brekl. 6","Lattr. Brekl. 6","Lattr. Brekl. 7"]
[{"$f":"C9","v":"O.Ootmarsum 7"},"-",{"$f":"C6","v":"O.Ootmarsum 8"},{"$f":"'wedstr. 2'!K14","v":0},{"$f":"'wedstr. 2'!L14","v":"-"},{"$f":"'wedstr. 2'!M14","v":4},null,{"$f":"C6","v":"O.Ootmarsum 8"},"-",{"$f":"C9","v":"O.Ootmarsum 7"},{"$f":"'wedstr. 9'!K14","v":4},"-",{"$f":"'wedstr. 9'!M14","v":0},null,"O.Ootmarsum 7","O.Ootmarsum 8","O.Ootmarsum 8","O.Ootmarsum 7"]
[{"$f":"C10","v":"Hertme 7"},"-",{"$f":"C7","v":"Hertme 8"},{"$f":"'wedstr. 2'!K15","v":0},{"$f":"'wedstr. 2'!L15","v":"-"},{"$f":"'wedstr. 2'!M15","v":4},null,{"$f":"C7","v":"Hertme 8"},"-",{"$f":"C10","v":"Hertme 7"},{"$f":"'wedstr. 9'!K15","v":4},"-",{"$f":"'wedstr. 9'!M15","v":0},null,"Hertme 7","Hertme 8","Hertme 8","Hertme 7"]
[{"$f":"C11","v":"Soasel 6"},"-",{"$f":"C4","v":"vrij"},{"$f":"'wedstr. 2'!K16","v":0},{"$f":"'wedstr. 2'!L16","v":"-"},{"$f":"'wedstr. 2'!M16","v":0},null,{"$f":"C4","v":"vrij"},"-",{"$f":"C11","v":"Soasel 6"},{"$f":"'wedstr. 9'!K16","v":0},"-",{"$f":"'wedstr. 9'!M16","v":0},null,0,0,0,0]
[null,null,null,null,null,null,null,null,null,null,null,null,null,null,0,0,0,0]
[null,null,null,null,null,null,null,null,null,null,null,null,null,null,0,0,0,0]
[null,3,null,null,null,null,null,null,10,null,null,null,null,null,0,0,0,0]
[null,null,null,null,null,null,null,null,null,null,null,null,null,null,0,0,0,0]
[{"$f":"C4","v":"vrij"},"-",{"$f":"C9","v":"O.Ootmarsum 7"},{"$f":"'wedstr. 3'!K13","v":0},"-",{"$f":"'wedstr. 3'!M13","v":0},null,{"$f":"C9","v":"O.Ootmarsum 7"},"-",{"$f":"C4","v":"vrij"},{"$f":"'wedstr. 10'!K13","v":0},"-",{"$f":"'wedstr. 10'!M13","v":0},null,0,0,0,0]
[{"$f":"C5","v":"Lattr. Brekl. 6"},"-",{"$f":"C10","v":"Hertme 7"},{"$f":"'wedstr. 3'!K14","v":4},"-",{"$f":"'wedstr. 3'!M14","v":0},null,{"$f":"C10","v":"Hertme 7"},"-",{"$f":"C5","v":"Lattr. Brekl. 6"},{"$f":"'wedstr. 10'!K14","v":0},"-",{"$f":"'wedstr. 10'!M14","v":4},null,"Lattr. Brekl. 6","Hertme 7","Hertme 7","Lattr. Brekl. 6"]
[{"$f":"C6","v":"O.Ootmarsum 8"},"-",{"$f":"C11","v":"Soasel 6"},{"$f":"'wedstr. 3'!K15","v":4},"-",{"$f":"'wedstr. 3'!M15","v":0},null,{"$f":"C11","v":"Soasel 6"},"-",{"$f":"C6","v":"O.Ootmarsum 8"},{"$f":"'wedstr. 10'!K15","v":0},"-",{"$f":"'wedstr. 10'!M15","v":4},null,"O.Ootmarsum 8","Soasel 6","Soasel 6","O.Ootmarsum 8"]
[{"$f":"C7","v":"Hertme 8"},"-",{"$f":"C8","v":"Lattr. Brekl. 7"},{"$f":"'wedstr. 3'!K16","v":2},"-",{"$f":"'wedstr. 3'!M16","v":2},null,{"$f":"C8","v":"Lattr. Brekl. 7"},"-",{"$f":"C7","v":"Hertme 8"},{"$f":"'wedstr. 10'!K16","v":2},"-",{"$f":"'wedstr. 10'!M16","v":2},null,"Hertme 8","Lattr. Brekl. 7","Lattr. Brekl. 7","Hertme 8"]
[null,null,null,null,null,null,null,null,null,null,null,null,null,null,0,0,0,0]
[null,null,null,null,null,null,null,null,null,null,null,null,null,null,0,0,0,0]
[null,4,null,null,null,null,null,null,11,null,null,null,null,null,0,0,0,0]
[null,null,null,null,null,null,null,null,null,null,null,null,null,null,0,0,0,0]
[{"$f":"C8","v":"Lattr. Brekl. 7"},"-",{"$f":"C6","v":"O.Ootmarsum 8"},{"$f":"'wedstr. 4'!K13","v":2},"-",{"$f":"'wedstr. 4'!M13","v":2},null,{"$f":"C6","v":"O.Ootmarsum 8"},"-",{"$f":"C8","v":"Lattr. Brekl. 7"},{"$f":"'wedstr. 11'!K13","v":3},"-",{"$f":"'wedstr. 11'!M13","v":1},null,"Lattr. Brekl. 7","O.Ootmarsum 8","O.Ootmarsum 8","Lattr. Brekl. 7"]
[{"$f":"C9","v":"O.Ootmarsum 7"},"-",{"$f":"C7","v":"Hertme 8"},{"$f":"'wedstr. 4'!K14","v":4},"-",{"$f":"'wedstr. 4'!M14","v":0},null,{"$f":"C7","v":"Hertme 8"},"-",{"$f":"C9","v":"O.Ootmarsum 7"},{"$f":"'wedstr. 11'!K14","v":1},"-",{"$f":"'wedstr. 11'!M14","v":3},null,"O.Ootmarsum 7","Hertme 8","Hertme 8","O.Ootmarsum 7"]
[{"$f":"C10","v":"Hertme 7"},"-",{"$f":"C4","v":"vrij"},{"$f":"'wedstr. 4'!K15","v":0},"-",{"$f":"'wedstr. 4'!M15","v":0},null,{"$f":"C4","v":"vrij"},"-",{"$f":"C10","v":"Hertme 7"},{"$f":"'wedstr. 11'!K15","v":0},"-",{"$f":"'wedstr. 11'!M15","v":0},null,0,0,0,0]
[{"$f":"C11","v":"Soasel 6"},"-",{"$f":"C5","v":"Lattr. Brekl. 6"},{"$f":"'wedstr. 4'!K16","v":0},"-",{"$f":"'wedstr. 4'!M16","v":4},null,{"$f":"C5","v":"Lattr. Brekl. 6"},"-",{"$f":"C11","v":"Soasel 6"},{"$f":"'wedstr. 11'!K16","v":1},"-",{"$f":"'wedstr. 11'!M16","v":3},null,"Soasel 6","Lattr. Brekl. 6","Lattr. Brekl. 6","Soasel 6"]
[null,null,null,null,null,null,null,null,null,null,null,null,null,null,0,0,0,0]
[null,null,null,null,null,null,null,null,null,null,null,null,null,null,0,0,0,0]
[null,5,null,null,null,null,null,null,12,null,null,null,null,null,0,0,0,0]
[null,null,null,null,null,null,null,null,null,null,null,null,null,null,0,0,0,0]
[{"$f":"C4","v":"vrij"},"-",{"$f":"C5","v":"Lattr. Brekl. 6"},{"$f":"'wedstr. 5'!K13","v":0},"-",{"$f":"'wedstr. 5'!M13","v":0},null,{"$f":"C5","v":"Lattr. Brekl. 6"},"-",{"$f":"C4","v":"vrij"},{"$f":"'wedstr. 12'!K13","v":0},"-",{"$f":"'wedstr. 12'!M13","v":0},null,0,0,0,0]
[{"$f":"C8","v":"Lattr. Brekl. 7"},"-",{"$f":"C9","v":"O.Ootmarsum 7"},{"$f":"'wedstr. 5'!K14","v":2},"-",{"$f":"'wedstr. 5'!M14","v":2},null,{"$f":"C9","v":"O.Ootmarsum 7"},"-",{"$f":"C8","v":"Lattr. Brekl. 7"},{"$f":"'wedstr. 12'!K14","v":4},"-",{"$f":"'wedstr. 12'!M14","v":0},null,"Lattr. Brekl. 7","O.Ootmarsum 7","O.Ootmarsum 7","Lattr. Brekl. 7"]
[{"$f":"C6","v":"O.Ootmarsum 8"},"-",{"$f":"C7","v":"Hertme 8"},{"$f":"'wedstr. 5'!K15","v":4},"-",{"$f":"'wedstr. 5'!M15","v":0},null,{"$f":"C7","v":"Hertme 8"},"-",{"$f":"C6","v":"O.Ootmarsum 8"},{"$f":"'wedstr. 12'!K15","v":0},"-",{"$f":"'wedstr. 12'!M15","v":4},null,"O.Ootmarsum 8","Hertme 8","Hertme 8","O.Ootmarsum 8"]
[{"$f":"C10","v":"Hertme 7"},"-",{"$f":"C11","v":"Soasel 6"},{"$f":"'wedstr. 5'!K16","v":2},"-",{"$f":"'wedstr. 5'!M16","v":2},null,{"$f":"C11","v":"Soasel 6"},"-",{"$f":"C10","v":"Hertme 7"},{"$f":"'wedstr. 12'!K16","v":4},"-",{"$f":"'wedstr. 12'!M16","v":0},null,"Hertme 7","Soasel 6","Soasel 6","Hertme 7"]
[null,null,null,null,null,null,null,null,null,null,null,null,null,null,0,0,0,0]
[null,null,null,null,null,null,null,null,null,null,null,null,null,null,0,0,0,0]
[null,6,null,null,null,null,null,null,13,null,null,null,null,null,0,0,0,0]
[null,null,null,null,null,null,null,null,null,null,null,null,null,null,0,0,0,0]
[{"$f":"C5","v":"Lattr. Brekl. 6"},"-",{"$f":"C6","v":"O.Ootmarsum 8"},{"$f":"'wedstr. 6'!K13","v":0},"-",{"$f":"'wedstr. 6'!M13","v":4},null,{"$f":"C6","v":"O.Ootmarsum 8"},"-",{"$f":"C5","v":"Lattr. Brekl. 6"},{"$f":"'wedstr. 13'!K13","v":3},"-",{"$f":"'wedstr. 13'!M13","v":1},null,"Lattr. Brekl. 6","O.Ootmarsum 8","O.Ootmarsum 8","Lattr. Brekl. 6"]
[{"$f":"C7","v":"Hertme 8"},"-",{"$f":"C4","v":"vrij"},{"$f":"'wedstr. 6'!K14","v":0},"-",{"$f":"'wedstr. 6'!M14","v":0},null,{"$f":"C4","v":"vrij"},"-",{"$f":"C7","v":"Hertme 8"},{"$f":"'wedstr. 13'!K14","v":0},"-",{"$f":"'wedstr. 13'!M14","v":0},null,0,0,0,0]
[{"$f":"C9","v":"O.Ootmarsum 7"},"-",{"$f":"C10","v":"Hertme 7"},{"$f":"'wedstr. 6'!K15","v":4},"-",{"$f":"'wedstr. 6'!M15","v":0},null,{"$f":"C10","v":"Hertme 7"},"-",{"$f":"C9","v":"O.Ootmarsum 7"},{"$f":"'wedstr. 13'!K15","v":0},"-",{"$f":"'wedstr. 13'!M15","v":4},null,"O.Ootmarsum 7","Hertme 7","Hertme 7","O.Ootmarsum 7"]
[{"$f":"C11","v":"Soasel 6"},"-",{"$f":"C8","v":"Lattr. Brekl. 7"},{"$f":"'wedstr. 6'!K16","v":1},"-",{"$f":"'wedstr. 6'!M16","v":3},null,{"$f":"C8","v":"Lattr. Brekl. 7"},"-",{"$f":"C11","v":"Soasel 6"},{"$f":"'wedstr. 13'!K16","v":1},"-",{"$f":"'wedstr. 13'!M16","v":3},null,"Soasel 6","Lattr. Brekl. 7","Lattr. Brekl. 7","Soasel 6"]
[null,null,null,null,null,null,null,null,null,null,null,null,null,null,0,0,0,0]
[null,null,null,null,null,null,null,null,null,null,null,null,null,null,0,0,0,0]
[null,7,null,null,null,null,null,null,14,null,null,null,null,null,0,0,0,0]
[null,null,null,null,null,null,null,null,null,null,null,null,null,null,0,0,0,0]
[{"$f":"C4","v":"vrij"},"-",{"$f":"C6","v":"O.Ootmarsum 8"},{"$f":"'wedstr. 7'!K13","v":0},"-",{"$f":"'wedstr. 7'!M13","v":0},null,{"$f":"C6","v":"O.Ootmarsum 8"},"-",{"$f":"C4","v":"vrij"},{"$f":"'wedstr. 14'!K13","v":0},"-",{"$f":"'wedstr. 14'!M13","v":0},null,0,0,0,0]
[{"$f":"C8","v":"Lattr. Brekl. 7"},"-",{"$f":"C10","v":"Hertme 7"},{"$f":"'wedstr. 7'!K14","v":4},"-",{"$f":"'wedstr. 7'!M14","v":0},null,{"$f":"C10","v":"Hertme 7"},"-",{"$f":"C8","v":"Lattr. Brekl. 7"},{"$f":"'wedstr. 14'!K14","v":2},"-",{"$f":"'wedstr. 14'!M14","v":2},null,"Lattr. Brekl. 7","Hertme 7","Hertme 7","Lattr. Brekl. 7"]
[{"$f":"C9","v":"O.Ootmarsum 7"},"-",{"$f":"C11","v":"Soasel 6"},{"$f":"'wedstr. 7'!K15","v":4},"-",{"$f":"'wedstr. 7'!M15","v":0},null,{"$f":"C11","v":"Soasel 6"},"-",{"$f":"C9","v":"O.Ootmarsum 7"},{"$f":"'wedstr. 14'!K15","v":0},"-",{"$f":"'wedstr. 14'!M15","v":4},null,"O.Ootmarsum 7","Soasel 6","Soasel 6","O.Ootmarsum 7"]
[{"$f":"C7","v":"Hertme 8"},"-",{"$f":"C5","v":"Lattr. Brekl. 6"},{"$f":"'wedstr. 7'!K16","v":4},"-",{"$f":"'wedstr. 7'!M16","v":0},null,{"$f":"C5","v":"Lattr. Brekl. 6"},"-",{"$f":"C7","v":"Hertme 8"},{"$f":"'wedstr. 14'!K16","v":4},"-",{"$f":"'wedstr. 14'!M16","v":0},null,"Hertme 8","Lattr. Brekl. 6","Lattr. Brekl. 6","Hertme 8"]

{"sheet":"5e klasse","index":22,"n_rows":65,"n_cols":18,"rows_kept":65,"cut":false,"hidden":false,"merged":[]}
[null,null,"5e Klasse"]
[null,null,"Team","G",null,"P"]
[]
[null,"A","Soasel 7",{"$f":"COUNTIF($O$15:$R$65,C4)","v":12},"-",{"$f":"SUMIF($A$15:$A$65,C4,$D$15:$D$65)+SUMIF($C$15:$C$65,C4,$F$15:$F$65)+SUMIF($H$15:$H$65,C4,$K$15:$K$65)+SUMIF($J$15:$J$65,C4,$M$15:$M$65)","v":21},null,null,null,"Gunne 5",{"$f":"COUNTIF($O$15:$R$65,J4)","v":12},"-",{"$f":"SUMIF($A$15:$A$65,J4,$D$15:$D$65)+SUMIF($C$15:$C$65,J4,$F$15:$F$65)+SUMIF($H$15:$H$65,J4,$K$15:$K$65)+SUMIF($J$15:$J$65,J4,$M$15:$M$65)","v":25}]
[null,"B","Gunne 5",{"$f":"COUNTIF($O$15:$R$65,C5)","v":12},"-",{"$f":"SUMIF($A$15:$A$65,C5,$D$15:$D$65)+SUMIF($C$15:$C$65,C5,$F$15:$F$65)+SUMIF($H$15:$H$65,C5,$K$15:$K$65)+SUMIF($J$15:$J$65,C5,$M$15:$M$65)","v":25},null,null,null,"Hertme 9",12,"-",16]
[null,"C","O.Ootmarsum 9",12,"-",44,null,null,null,"Lattr. Brekl. 8",12,"-",13]
[null,"D","Nijstad 4",12,"-",23,null,null,null,"Nijstad 4",12,"-",23]
[null,"E","vrij",0,"-",0,null,null,null,"O.Ootmarsum 10",12,"-",26]
[null,"F","O.Ootmarsum 10",12,"-",26,null,null,null,"O.Ootmarsum 9",12,"-",44,null,null,null,null,"S"]
[null,"G","Hertme 9",12,"-",16,null,null,null,"Soasel 7",12,"-",21]
[null,"H","Lattr. Brekl. 8",12,"-",13,null,null,null,"vrij",0,"-",0]
[]
[null,1,null,null,null,null,null,null,8]
[]
[{"$f":"C4","v":"Soasel 7"},"-",{"$f":"C8","v":"vrij"},{"$f":"'Wedstr. 1'!D20","v":0},{"$f":"'Wedstr. 1'!E20","v":"-"},{"$f":"'Wedstr. 1'!F20","v":0},null,{"$f":"C8","v":"vrij"},"-",{"$f":"C4","v":"Soasel 7"},{"$f":"'wedstr. 8'!D20","v":0},{"$f":"'wedstr. 8'!E20","v":"-"},{"$f":"'wedstr. 8'!F20","v":0},null,{"$f":"IF($D15+$F15=4,A15,)","v":0},{"$f":"IF($D15+$F15=4,C15,)","v":0},{"$f":"IF($K15+$M15=4,H15,)","v":0},{"$f":"IF($K15+$M15=4,J15,)","v":0}]
[{"$f":"C5","v":"Gunne 5"},"-",{"$f":"C9","v":"O.Ootmarsum 10"},{"$f":"'Wedstr. 1'!D21","v":4},{"$f":"'Wedstr. 1'!E21","v":"-"},{"$f":"'Wedstr. 1'!F21","v":0},null,{"$f":"C9","v":"O.Ootmarsum 10"},"-",{"$f":"C5","v":"Gunne 5"},{"$f":"'wedstr. 8'!D21","v":1},{"$f":"'wedstr. 8'!E21","v":"-"},{"$f":"'wedstr. 8'!F21","v":3},null,{"$f":"IF($D16+$F16=4,A16,)","v":"Gunne 5"},{"$f":"IF($D16+$F16=4,C16,)","v":"O.Ootmarsum 10"},{"$f":"IF($K16+$M16=4,H16,)","v":"O.Ootmarsum 10"},{"$f":"IF($K16+$M16=4,J16,)","v":"Gunne 5"}]
[{"$f":"C6","v":"O.Ootmarsum 9"},"-",{"$f":"C10","v":"Hertme 9"},{"$f":"'Wedstr. 1'!D22","v":4},{"$f":"'Wedstr. 1'!E22","v":"-"},{"$f":"'Wedstr. 1'!F22","v":0},null,{"$f":"C10","v":"Hertme 9"},"-",{"$f":"C6","v":"O.Ootmarsum 9"},{"$f":"'wedstr. 8'!D22","v":0},{"$f":"'wedstr. 8'!E22","v":"-"},{"$f":"'wedstr. 8'!F22","v":4},null,"O.Ootmarsum 9","Hertme 9","Hertme 9","O.Ootmarsum 9"]
[{"$f":"C7","v":"Nijstad 4"},"-",{"$f":"C11","v":"Lattr. Brekl. 8"},{"$f":"'Wedstr. 1'!D23","v":0},{"$f":"'Wedstr. 1'!E23","v":"-"},{"$f":"'Wedstr. 1'!F23","v":4},null,{"$f":"C11","v":"Lattr. Brekl. 8"},"-",{"$f":"C7","v":"Nijstad 4"},{"$f":"'wedstr. 8'!D23","v":0},{"$f":"'wedstr. 8'!E23","v":"-"},{"$f":"'wedstr. 8'!F23","v":4},null,"Nijstad 4","Lattr. Brekl. 8","Lattr. Brekl. 8","Nijstad 4"]
[null,null,null,null,null,null,null,null,null,null,null,null,null,null,0,0,0,0]
[null,2,null,null,null,null,null,null,9,null,null,null,null,null,0,0,0,0]
[null,null,null,null,null,null,null,null,null,null,null,null,null,null,0,0,0,0]
[{"$f":"C8","v":"vrij"},"-",{"$f":"C5","v":"Gunne 5"},{"$f":"'wedstr. 2'!D20","v":0},{"$f":"'wedstr. 2'!E20","v":"-"},{"$f":"'wedstr. 2'!F20","v":0},null,{"$f":"C5","v":"Gunne 5"},"-",{"$f":"C8","v":"vrij"},{"$f":"'wedstr. 9'!D20","v":0},{"$f":"'wedstr. 9'!E20","v":"-"},{"$f":"'wedstr. 9'!F20","v":0},null,0,0,0,0]
[{"$f":"C9","v":"O.Ootmarsum 10"},"-",{"$f":"C6","v":"O.Ootmarsum 9"},{"$f":"'wedstr. 2'!D21","v":0},{"$f":"'wedstr. 2'!E21","v":"-"},{"$f":"'wedstr. 2'!F21","v":4},null,{"$f":"C6","v":"O.Ootmarsum 9"},"-",{"$f":"C9","v":"O.Ootmarsum 10"},{"$f":"'wedstr. 9'!D21","v":4},{"$f":"'wedstr. 9'!E21","v":"-"},{"$f":"'wedstr. 9'!F21","v":0},null,"O.Ootmarsum 10","O.Ootmarsum 9","O.Ootmarsum 9","O.Ootmarsum 10"]
[{"$f":"C10","v":"Hertme 9"},"-",{"$f":"C7","v":"Nijstad 4"},{"$f":"'wedstr. 2'!D22","v":1},{"$f":"'wedstr. 2'!E22","v":"-"},{"$f":"'wedstr. 2'!F22","v":3},null,{"$f":"C7","v":"Nijstad 4"},"-",{"$f":"C10","v":"Hertme 9"},{"$f":"'wedstr. 9'!D22","v":3},{"$f":"'wedstr. 9'!E22","v":"-"},{"$f":"'wedstr. 9'!F22","v":1},null,"Hertme 9","Nijstad 4","Nijstad 4","Hertme 9"]
[{"$f":"C11","v":"Lattr. Brekl. 8"},"-",{"$f":"C4","v":"Soasel 7"},{"$f":"'wedstr. 2'!D23","v":0},{"$f":"'wedstr. 2'!E23","v":"-"},{"$f":"'wedstr. 2'!F23","v":4},null,{"$f":"C4","v":"Soasel 7"},"-",{"$f":"C11","v":"Lattr. Brekl. 8"},{"$f":"'wedstr. 9'!D23","v":3},{"$f":"'wedstr. 9'!E23","v":"-"},{"$f":"'wedstr. 9'!F23","v":1},null,"Lattr. Brekl. 8","Soasel 7","Soasel 7","Lattr. Brekl. 8"]
[null,null,null,null,null,null,null,null,null,null,null,null,null,null,0,0,0,0]
[null,null,null,null,null,null,null,null,null,null,null,null,null,null,0,0,0,0]
[null,3,null,null,null,null,null,null,10,null,null,null,null,null,0,0,0,0]
[null,null,null,null,null,null,null,null,null,null,null,null,null,null,0,0,0,0]
[{"$f":"C4","v":"Soasel 7"},"-",{"$f":"C9","v":"O.Ootmarsum 10"},{"$f":"'wedstr. 3'!D20","v":1},{"$f":"'wedstr. 3'!E20","v":"-"},{"$f":"'wedstr. 3'!F20","v":3},null,{"$f":"C9","v":"O.Ootmarsum 10"},"-",{"$f":"C4","v":"Soasel 7"},{"$f":"'wedstr. 10'!D20","v":3},{"$f":"'wedstr. 10'!E20","v":"-"},{"$f":"'wedstr. 10'!F20","v":1},null,"Soasel 7","O.Ootmarsum 10","O.Ootmarsum 10","Soasel 7"]
[{"$f":"C5","v":"Gunne 5"},"-",{"$f":"C10","v":"Hertme 9"},{"$f":"'wedstr. 3'!D21","v":1},{"$f":"'wedstr. 3'!E21","v":"-"},{"$f":"'wedstr. 3'!F21","v":3},null,{"$f":"C10","v":"Hertme 9"},"-",{"$f":"C5","v":"Gunne 5"},{"$f":"'wedstr. 10'!D21","v":2},{"$f":"'wedstr. 10'!E21","v":"-"},{"$f":"'wedstr. 10'!F21","v":2},null,"Gunne 5","Hertme 9","Hertme 9","Gunne 5"]
[{"$f":"C6","v":"O.Ootmarsum 9"},"-",{"$f":"C11","v":"Lattr. Brekl. 8"},{"$f":"'wedstr. 3'!D22","v":4},{"$f":"'wedstr. 3'!E22","v":"-"},{"$f":"'wedstr. 3'!F22","v":0},null,{"$f":"C11","v":"Lattr. Brekl. 8"},"-",{"$f":"C6","v":"O.Ootmarsum 9"},{"$f":"'wedstr. 10'!D22","v":0},{"$f":"'wedstr. 10'!E22","v":"-"},{"$f":"'wedstr. 10'!F22","v":4},null,"O.Ootmarsum 9","Lattr. Brekl. 8","Lattr. Brekl. 8","O.Ootmarsum 9"]
[{"$f":"C7","v":"Nijstad 4"},"-",{"$f":"C8","v":"vrij"},{"$f":"'wedstr. 3'!D23","v":0},{"$f":"'wedstr. 3'!E23","v":"-"},{"$f":"'wedstr. 3'!F23","v":0},null,{"$f":"C8","v":"vrij"},"-",{"$f":"C7","v":"Nijstad 4"},{"$f":"'wedstr. 10'!D23","v":0},{"$f":"'wedstr. 10'!E23","v":"-"},{"$f":"'wedstr. 10'!F23","v":0},null,0,0,0,0]
[null,null,null,null,null,null,null,null,null,null,null,null,null,null,0,0,0,0]
[null,null,null,null,null,null,null,null,null,null,null,null,null,null,0,0,0,0]
[null,4,null,null,null,null,null,null,11,null,null,null,null,null,0,0,0,0]
[null,null,null,null,null,null,null,null,null,null,null,null,null,null,0,0,0,0]
[{"$f":"C8","v":"vrij"},"-",{"$f":"C6","v":"O.Ootmarsum 9"},{"$f":"'wedstr. 4'!D20","v":0},{"$f":"'wedstr. 4'!E20","v":"-"},{"$f":"'wedstr. 4'!F20","v":0},null,{"$f":"C6","v":"O.Ootmarsum 9"},"-",{"$f":"C8","v":"vrij"},{"$f":"'wedstr. 11'!D20","v":0},{"$f":"'wedstr. 11'!E20","v":"-"},{"$f":"'wedstr. 11'!F20","v":0},null,0,0,0,0]
[{"$f":"C9","v":"O.Ootmarsum 10"},"-",{"$f":"C7","v":"Nijstad 4"},{"$f":"'wedstr. 4'!D21","v":2},{"$f":"'wedstr. 4'!E21","v":"-"},{"$f":"'wedstr. 4'!F21","v":2},null,{"$f":"C7","v":"Nijstad 4"},"-",{"$f":"C9","v":"O.Ootmarsum 10"},{"$f":"'wedstr. 11'!D21","v":2},{"$f":"'wedstr. 11'!E21","v":"-"},{"$f":"'wedstr. 11'!F21","v":2},null,"O.Ootmarsum 10","Nijstad 4","Nijstad 4","O.Ootmarsum 10"]
[{"$f":"C10","v":"Hertme 9"},"-",{"$f":"C4","v":"Soasel 7"},{"$f":"'wedstr. 4'!D22","v":1},{"$f":"'wedstr. 4'!E22","v":"-"},{"$f":"'wedstr. 4'!F22","v":3},null,{"$f":"C4","v":"Soasel 7"},"-",{"$f":"C10","v":"Hertme 9"},{"$f":"'wedstr. 11'!D22","v":2},{"$f":"'wedstr. 11'!E22","v":"-"},{"$f":"'wedstr. 11'!F22","v":2},null,"Hertme 9","Soasel 7","Soasel 7","Hertme 9"]
[{"$f":"C11","v":"Lattr. Brekl. 8"},"-",{"$f":"C5","v":"Gunne 5"},{"$f":"'wedstr. 4'!D23","v":2},{"$f":"'wedstr. 4'!E23","v":"-"},{"$f":"'wedstr. 4'!F23","v":2},null,{"$f":"C5","v":"Gunne 5"},"-",{"$f":"C11","v":"Lattr. Brekl. 8"},{"$f":"'wedstr. 11'!D23","v":1},{"$f":"'wedstr. 11'!E23","v":"-"},{"$f":"'wedstr. 11'!F23","v":3},null,"Lattr. Brekl. 8","Gunne 5","Gunne 5","Lattr. Brekl. 8"]
[null,null,null,null,null,null,null,null,null,null,null,null,null,null,0,0,0,0]
[null,null,null,null,null,null,null,null,null,null,null,null,null,null,0,0,0,0]
[null,5,null,null,null,null,null,null,12,null,null,null,null,null,0,0,0,0]
[null,null,null,null,null,null,null,null,null,null,null,null,null,null,0,0,0,0]
[{"$f":"C4","v":"Soasel 7"},"-",{"$f":"C5","v":"Gunne 5"},{"$f":"'wedstr. 5'!D20","v":2},{"$f":"'wedstr. 5'!E20","v":"-"},{"$f":"'wedstr. 5'!F20","v":2},null,{"$f":"C5","v":"Gunne 5"},"-",{"$f":"C4","v":"Soasel 7"},{"$f":"'wedstr. 12'!D20","v":2},{"$f":"'wedstr. 12'!E20","v":"-"},{"$f":"'wedstr. 12'!F20","v":2},null,"Soasel 7","Gunne 5","Gunne 5","Soasel 7"]
[{"$f":"C8","v":"vrij"},"-",{"$f":"C9","v":"O.Ootmarsum 10"},{"$f":"'wedstr. 5'!D21","v":0},{"$f":"'wedstr. 5'!E21","v":"-"},{"$f":"'wedstr. 5'!F21","v":0},null,{"$f":"C9","v":"O.Ootmarsum 10"},"-",{"$f":"C8","v":"vrij"},{"$f":"'wedstr. 12'!D21","v":0},{"$f":"'wedstr. 12'!E21","v":"-"},{"$f":"'wedstr. 12'!F21","v":0},null,0,0,0,0]
[{"$f":"C6","v":"O.Ootmarsum 9"},"-",{"$f":"C7","v":"Nijstad 4"},{"$f":"'wedstr. 5'!D22","v":4},{"$f":"'wedstr. 5'!E22","v":"-"},{"$f":"'wedstr. 5'!F22","v":0},null,{"$f":"C7","v":"Nijstad 4"},"-",{"$f":"C6","v":"O.Ootmarsum 9"},{"$f":"'wedstr. 12'!D22","v":2},{"$f":"'wedstr. 12'!E22","v":"-"},{"$f":"'wedstr. 12'!F22","v":2},null,"O.Ootmarsum 9","Nijstad 4","Nijstad 4","O.Ootmarsum 9"]
[{"$f":"C10","v":"Hertme 9"},"-",{"$f":"C11","v":"Lattr. Brekl. 8"},{"$f":"'wedstr. 5'!D23","v":2},{"$f":"'wedstr. 5'!E23","v":"-"},{"$f":"'wedstr. 5'!F23","v":2},null,{"$f":"C11","v":"Lattr. Brekl. 8"},"-",{"$f":"C10","v":"Hertme 9"},{"$f":"'wedstr. 12'!D23","v":1},{"$f":"'wedstr. 12'!E23","v":"-"},{"$f":"'wedstr. 12'!F23","v":3},null,"Hertme 9","Lattr. Brekl. 8","Lattr. Brekl. 8","Hertme 9"]
[null,null,null,null,null,null,null,null,null,null,null,null,null,null,0,0,0,0]
[null,null,null,null,null,null,null,null,null,null,null,null,null,null,0,0,0,0]
[null,6,null,null,null,null,null,null,13,null,null,null,null,null,0,0,0,0]
[null,null,null,null,null,null,null,null,null,null,null,null,null,null,0,0,0,0]
[{"$f":"C5","v":"Gunne 5"},"-",{"$f":"C6","v":"O.Ootmarsum 9"},{"$f":"'wedstr. 6'!D20","v":1},{"$f":"'wedstr. 6'!E20","v":"-"},{"$f":"'wedstr. 6'!F20","v":3},null,{"$f":"C6","v":"O.Ootmarsum 9"},"-",{"$f":"C5","v":"Gunne 5"},{"$f":"'wedstr. 13'!D20","v":3},{"$f":"'wedstr. 13'!E20","v":"-"},{"$f":"'wedstr. 13'!F20","v":1},null,"Gunne 5","O.Ootmarsum 9","O.Ootmarsum 9","Gunne 5"]
[{"$f":"C7","v":"Nijstad 4"},"-",{"$f":"C4","v":"Soasel 7"},{"$f":"'wedstr. 6'!D21","v":2},{"$f":"'wedstr. 6'!E21","v":0},{"$f":"'wedstr. 6'!F21","v":2},null,{"$f":"C4","v":"Soasel 7"},"-",{"$f":"C7","v":"Nijstad 4"},{"$f":"'wedstr. 13'!D21","v":1},{"$f":"'wedstr. 13'!E21","v":"-"},{"$f":"'wedstr. 13'!F21","v":3},null,"Nijstad 4","Soasel 7","Soasel 7","Nijstad 4"]
[{"$f":"C9","v":"O.Ootmarsum 10"},"-",{"$f":"C10","v":"Hertme 9"},{"$f":"'wedstr. 6'!D22","v":4},{"$f":"'wedstr. 6'!E22","v":"-"},{"$f":"'wedstr. 6'!F22","v":0},null,{"$f":"C10","v":"Hertme 9"},"-",{"$f":"C9","v":"O.Ootmarsum 10"},{"$f":"'wedstr. 13'!D22","v":1},{"$f":"'wedstr. 13'!E22","v":"-"},{"$f":"'wedstr. 13'!F22","v":3},null,"O.Ootmarsum 10","Hertme 9","Hertme 9","O.Ootmarsum 10"]
[{"$f":"C11","v":"Lattr. Brekl. 8"},"-",{"$f":"C8","v":"vrij"},{"$f":"'wedstr. 6'!D23","v":0},{"$f":"'wedstr. 6'!E23","v":"-"},{"$f":"'wedstr. 6'!F23","v":0},null,{"$f":"C8","v":"vrij"},"-",{"$f":"C11","v":"Lattr. Brekl. 8"},{"$f":"'wedstr. 13'!D23","v":0},{"$f":"'wedstr. 13'!E23","v":"-"},{"$f":"'wedstr. 13'!F23","v":0},null,0,0,0,0]
[null,null,null,null,null,null,null,null,null,null,null,null,null,null,0,0,0,0]
[null,null,null,null,null,null,null,null,null,null,null,null,null,null,0,0,0,0]
[null,7,null,null,null,null,null,null,14,null,null,null,null,null,0,0,0,0]
[null,null,null,null,null,null,null,null,null,null,null,null,null,null,0,0,0,0]
[{"$f":"C4","v":"Soasel 7"},"-",{"$f":"C6","v":"O.Ootmarsum 9"},{"$f":"'wedstr. 7'!D20","v":0},{"$f":"'wedstr. 7'!E20","v":"-"},{"$f":"'wedstr. 7'!F20","v":4},null,{"$f":"C6","v":"O.Ootmarsum 9"},"-",{"$f":"C4","v":"Soasel 7"},{"$f":"'wedstr. 14'!D20","v":4},{"$f":"'wedstr. 14'!E20","v":"-"},{"$f":"'wedstr. 14'!F20","v":0},null,"Soasel 7","O.Ootmarsum 9","O.Ootmarsum 9","Soasel 7"]
[{"$f":"C8","v":"vrij"},"-",{"$f":"C10","v":"Hertme 9"},{"$f":"'wedstr. 7'!D21","v":0},{"$f":"'wedstr. 7'!E21","v":"-"},{"$f":"'wedstr. 7'!F21","v":0},null,{"$f":"C10","v":"Hertme 9"},"-",{"$f":"C8","v":"vrij"},{"$f":"'wedstr. 14'!D21","v":0},{"$f":"'wedstr. 14'!E21","v":"-"},{"$f":"'wedstr. 14'!F21","v":0},null,0,0,0,0]
[{"$f":"C9","v":"O.Ootmarsum 10"},"-",{"$f":"C11","v":"Lattr. Brekl. 8"},{"$f":"'wedstr. 7'!D22","v":4},{"$f":"'wedstr. 7'!E22","v":"-"},{"$f":"'wedstr. 7'!F22","v":0},null,{"$f":"C11","v":"Lattr. Brekl. 8"},"-",{"$f":"C9","v":"O.Ootmarsum 10"},{"$f":"'wedstr. 14'!D22","v":0},{"$f":"'wedstr. 14'!E22","v":"-"},{"$f":"'wedstr. 14'!F22","v":4},null,"O.Ootmarsum 10","Lattr. Brekl. 8","Lattr. Brekl. 8","O.Ootmarsum 10"]
[{"$f":"C7","v":"Nijstad 4"},"-",{"$f":"C5","v":"Gunne 5"},{"$f":"'wedstr. 7'!D23","v":1},{"$f":"'wedstr. 7'!E23","v":"-"},{"$f":"'wedstr. 7'!F23","v":3},null,{"$f":"C5","v":"Gunne 5"},"-",{"$f":"C7","v":"Nijstad 4"},{"$f":"'wedstr. 14'!D23","v":3},{"$f":"'wedstr. 14'!E23","v":"-"},{"$f":"'wedstr. 14'!F23","v":1},null,"Nijstad 4","Gunne 5","Gunne 5","Nijstad 4"]

{"sheet":"6e klasse","index":23,"n_rows":59,"n_cols":18,"rows_kept":59,"cut":false,"hidden":false,"merged":[]}
[null,null,"6e Klasse"]
[null,null,"Team","G",null,"P"]
[]
[null,"A","Hertme 10",{"$f":"COUNTIF($O$15:$R$59,C4)","v":15},"-",{"$f":"SUMIF($A$15:$A$59,C4,$D$15:$D$59)+SUMIF($C$15:$C$59,C4,$F$15:$F$59)+SUMIF($H$15:$H$59,C4,$K$15:$K$59)+SUMIF($J$15:$J$59,C4,$M$15:$M$59)","v":25},null,null,null,"Brink 5",{"$f":"COUNTIF($O$15:$R$59,J4)","v":15},"-",{"$f":"SUMIF($A$15:$A$59,J4,$D$15:$D$59)+SUMIF($C$15:$C$59,J4,$F$15:$F$59)+SUMIF($H$15:$H$59,J4,$K$15:$K$59)+SUMIF($J$15:$J$59,J4,$M$15:$M$59)","v":54}]
[null,"B","Wilskracht 5",15,"-",38,null,null,null,"Hertme 10",15,"-",25]
[null,"C","Brink 5",15,"-",54,null,null,null,"Lattr. Brekl. 9",15,"-",33]
[null,"D","Lattr. Brekl. 9",15,"-",33,null,null,null,"O.Ootmarsum 11",15,"-",12]
[null,"E","Soasel 8",15,"-",18,null,null,null,"Soasel 8",15,"-",18]
[null,"F","O.Ootmarsum 11",15,"-",12,null,null,null,"Wilskracht 5",15,"-",38]
[]
[]
[]
[" ",1,null,null,null,null,null,null,9]
[]
[{"$f":"C4","v":"Hertme 10"},"-",{"$f":"C7","v":"Lattr. Brekl. 9"},{"$f":"'Wedstr. 1'!K20","v":2},{"$f":"'Wedstr. 1'!L20","v":"-"},{"$f":"'Wedstr. 1'!M20","v":2},null,{"$f":"C4","v":"Hertme 10"},"-",{"$f":"C6","v":"Brink 5"},{"$f":"'wedstr. 9'!K20","v":0},{"$f":"'wedstr. 9'!L20","v":"-"},{"$f":"'wedstr. 9'!M20","v":4},null,{"$f":"IF($D15+$F15=4,A15,)","v":"Hertme 10"},{"$f":"IF($D15+$F15=4,C15,)","v":"Lattr. Brekl. 9"},{"$f":"IF($K15+$M15=4,H15,)","v":"Hertme 10"},{"$f":"IF($K15+$M15=4,J15,)","v":"Brink 5"}]
[{"$f":"C5","v":"Wilskracht 5"},"-",{"$f":"C8","v":"Soasel 8"},{"$f":"'Wedstr. 1'!K21","v":4},{"$f":"'Wedstr. 1'!L21","v":"-"},{"$f":"'Wedstr. 1'!M21","v":0},null,{"$f":"C7","v":"Lattr. Brekl. 9"},"-",{"$f":"C5","v":"Wilskracht 5"},{"$f":"'wedstr. 9'!K21","v":3},{"$f":"'wedstr. 9'!L21","v":"-"},{"$f":"'wedstr. 9'!M21","v":1},null,{"$f":"IF($D16+$F16=4,A16,)","v":"Wilskracht 5"},{"$f":"IF($D16+$F16=4,C16,)","v":"Soasel 8"},{"$f":"IF($K16+$M16=4,H16,)","v":"Lattr. Brekl. 9"},{"$f":"IF($K16+$M16=4,J16,)","v":"Wilskracht 5"}]
[{"$f":"C6","v":"Brink 5"},"-",{"$f":"C9","v":"O.Ootmarsum 11"},{"$f":"'Wedstr. 1'!K22","v":2},{"$f":"'Wedstr. 1'!L22","v":"-"},{"$f":"'Wedstr. 1'!M22","v":2},null,{"$f":"C9","v":"O.Ootmarsum 11"},"-",{"$f":"C8","v":"Soasel 8"},{"$f":"'wedstr. 9'!K22","v":1},{"$f":"'wedstr. 9'!L22","v":"-"},{"$f":"'wedstr. 9'!M22","v":3},null,{"$f":"IF($D17+$F17=4,A17,)","v":"Brink 5"},{"$f":"IF($D17+$F17=4,C17,)","v":"O.Ootmarsum 11"},"O.Ootmarsum 11","Soasel 8"]
[null,null,null,null,null,null,null," "," "," ",null,null,null,null,{"$f":"IF($D18+$F18=4,A18,)","v":0},{"$f":"IF($D18+$F18=4,C18,)","v":0},0,0]
[null,2,null,null,null,null,null,null,10,null,null,null,null,null,{"$f":"IF($D19+$F19=4,A19,)","v":0},{"$f":"IF($D19+$F19=4,C19,)","v":0},0,0]
[null,null,null,null,null,null,null,null,null,null,null,null,null,null,0,0,0,0]
[{"$f":"C8","v":"Soasel 8"},"-",{"$f":"C4","v":"Hertme 10"},{"$f":"'wedstr. 2'!K20","v":2},{"$f":"'wedstr. 2'!L20","v":"-"},{"$f":"'wedstr. 2'!M20","v":2},null,{"$f":"C6","v":"Brink 5"},"-",{"$f":"C5","v":"Wilskracht 5"},{"$f":"'wedstr. 10'!K20","v":4},{"$f":"'wedstr. 10'!L20","v":"-"},{"$f":"'wedstr. 10'!M20","v":0},null,"Soasel 8","Hertme 10","Brink 5","Wilskracht 5"]
[{"$f":"C9","v":"O.Ootmarsum 11"},"-",{"$f":"C5","v":"Wilskracht 5"},{"$f":"'wedstr. 2'!K21","v":1},{"$f":"'wedstr. 2'!L21","v":"-"},{"$f":"'wedstr. 2'!M21","v":3},null,{"$f":"C9","v":"O.Ootmarsum 11"},"-",{"$f":"C4","v":"Hertme 10"},{"$f":"'wedstr. 10'!K21","v":1},{"$f":"'wedstr. 10'!L21","v":"-"},{"$f":"'wedstr. 10'!M21","v":3},null,"O.Ootmarsum 11","Wilskracht 5","O.Ootmarsum 11","Hertme 10"]
[{"$f":"C7","v":"Lattr. Brekl. 9"},"-",{"$f":"C6","v":"Brink 5"},{"$f":"'wedstr. 2'!K22","v":0},{"$f":"'wedstr. 2'!L22","v":"-"},{"$f":"'wedstr. 2'!M22","v":4},null,{"$f":"C8","v":"Soasel 8"},"-",{"$f":"C7","v":"Lattr. Brekl. 9"},{"$f":"'wedstr. 10'!K22","v":2},{"$f":"'wedstr. 10'!L22","v":"-"},{"$f":"'wedstr. 10'!M22","v":2},null,"Lattr. Brekl. 9","Brink 5","Soasel 8","Lattr. Brekl. 9"]
[" "," "," ",null,null,null,null," "," "," ",null,null,null,null,0,0,0,0]
[null,3,null,null,null,null,null,null,11,null,null,null,null,null,0,0,0,0]
[null,null,null,null,null,null,null,null,null,null,null,null,null,null,0,0,0,0]
[{"$f":"C4","v":"Hertme 10"},"-",{"$f":"C5","v":"Wilskracht 5"},{"$f":"'wedstr. 3'!K20","v":0},{"$f":"'wedstr. 3'!L20","v":"-"},{"$f":"'wedstr. 3'!M20","v":4},null,{"$f":"C4","v":"Hertme 10"},"-",{"$f":"C7","v":"Lattr. Brekl. 9"},{"$f":"'wedstr. 11'!K20","v":2},{"$f":"'wedstr. 11'!L20","v":"-"},{"$f":"'wedstr. 11'!M20","v":2},null,"Hertme 10","Wilskracht 5","Hertme 10","Lattr. Brekl. 9"]
[{"$f":"C6","v":"Brink 5"},"-",{"$f":"C8","v":"Soasel 8"},{"$f":"'wedstr. 3'!K21","v":4},{"$f":"'wedstr. 3'!L21","v":0},{"$f":"'wedstr. 3'!M21","v":0},null,{"$f":"C5","v":"Wilskracht 5"},"-",{"$f":"C8","v":"Soasel 8"},{"$f":"'wedstr. 11'!K21","v":2},{"$f":"'wedstr. 11'!L21","v":"-"},{"$f":"'wedstr. 11'!M21","v":2},null,"Brink 5","Soasel 8","Wilskracht 5","Soasel 8"]
[{"$f":"C9","v":"O.Ootmarsum 11"},"-",{"$f":"C7","v":"Lattr. Brekl. 9"},{"$f":"'wedstr. 3'!K22","v":0},{"$f":"'wedstr. 3'!L22","v":"-"},{"$f":"'wedstr. 3'!M22","v":4},null,{"$f":"C6","v":"Brink 5"},"-",{"$f":"C9","v":"O.Ootmarsum 11"},{"$f":"'wedstr. 11'!K22","v":4},{"$f":"'wedstr. 11'!L22","v":"-"},{"$f":"'wedstr. 11'!M22","v":0},null,"O.Ootmarsum 11","Lattr. Brekl. 9","Brink 5","O.Ootmarsum 11"]
[null,null,null,null,null,null,null,null,null,null,null,null,null,null,0,0,0,0]
[null,4,null,null,null,null,null,null,12,null,null,null,null,null,0,0,0,0]
[null,null,null,null,null,null,null,null,null,null,null,null,null,null,0,0,0,0]
[{"$f":"C6","v":"Brink 5"},"-",{"$f":"C4","v":"Hertme 10"},{"$f":"'wedstr. 4'!K20","v":3},{"$f":"'wedstr. 4'!L20","v":"-"},{"$f":"'wedstr. 4'!M20","v":1},null,{"$f":"C8","v":"Soasel 8"},"-",{"$f":"C4","v":"Hertme 10"},{"$f":"'wedstr. 12'!K20","v":1},{"$f":"'wedstr. 12'!L20","v":"-"},{"$f":"'wedstr. 12'!M20","v":3},null,"Brink 5","Hertme 10","Soasel 8","Hertme 10"]
[{"$f":"C5","v":"Wilskracht 5"},"-",{"$f":"C7","v":"Lattr. Brekl. 9"},{"$f":"'wedstr. 4'!K21","v":2},{"$f":"'wedstr. 4'!L21","v":"-"},{"$f":"'wedstr. 4'!M21","v":2},null,{"$f":"C9","v":"O.Ootmarsum 11"},"-",{"$f":"C5","v":"Wilskracht 5"},{"$f":"'wedstr. 12'!K21","v":1},{"$f":"'wedstr. 12'!L21","v":"-"},{"$f":"'wedstr. 12'!M21","v":3},null,"Wilskracht 5","Lattr. Brekl. 9","O.Ootmarsum 11","Wilskracht 5"]
[{"$f":"C8","v":"Soasel 8"},"-",{"$f":"C9","v":"O.Ootmarsum 11"},{"$f":"'wedstr. 4'!K22","v":1},{"$f":"'wedstr. 4'!L22","v":"-"},{"$f":"'wedstr. 4'!M22","v":3},null,{"$f":"C7","v":"Lattr. Brekl. 9"},"-",{"$f":"C6","v":"Brink 5"},{"$f":"'wedstr. 12'!K22","v":0},{"$f":"'wedstr. 12'!L22","v":"-"},{"$f":"'wedstr. 12'!M22","v":4},null,"Soasel 8","O.Ootmarsum 11","Lattr. Brekl. 9","Brink 5"]
[null,null,null,null,null,null,null," "," "," ",null,null,null,null,0,0,0,0]
[null,5,null,null,null,null,null,null,13,null,null,null,null,null,0,0,0,0]
[null,null,null,null,null,null,null,null,null,null,null,null,null,null,0,0,0,0]
[{"$f":"C5","v":"Wilskracht 5"},"-",{"$f":"C6","v":"Brink 5"},{"$f":"'wedstr. 5'!K20","v":0},{"$f":"'wedstr. 5'!L20","v":"-"},{"$f":"'wedstr. 5'!M20","v":4},null,{"$f":"C4","v":"Hertme 10"},"-",{"$f":"C5","v":"Wilskracht 5"},{"$f":"'wedstr. 13'!K20","v":2},{"$f":"'wedstr. 13'!L20","v":"-"},{"$f":"'wedstr. 13'!M20","v":2},null,"Wilskracht 5","Brink 5","Hertme 10","Wilskracht 5"]
[{"$f":"C4","v":"Hertme 10"},"-",{"$f":"C9","v":"O.Ootmarsum 11"},{"$f":"'wedstr. 5'!K21","v":4},{"$f":"'wedstr. 5'!L21","v":"-"},{"$f":"'wedstr. 5'!M21","v":0},null,{"$f":"C6","v":"Brink 5"},"-",{"$f":"C8","v":"Soasel 8"},{"$f":"'wedstr. 13'!K21","v":4},{"$f":"'wedstr. 13'!L21","v":"-"},{"$f":"'wedstr. 13'!M21","v":0},null,"Hertme 10","O.Ootmarsum 11","Brink 5","Soasel 8"]
[{"$f":"C7","v":"Lattr. Brekl. 9"},"-",{"$f":"C8","v":"Soasel 8"},{"$f":"'wedstr. 5'!K22","v":3},{"$f":"'wedstr. 5'!L22","v":"-"},{"$f":"'wedstr. 5'!M22","v":1},null,{"$f":"C9","v":"O.Ootmarsum 11"},"-",{"$f":"C7","v":"Lattr. Brekl. 9"},{"$f":"'wedstr. 13'!K22","v":2},{"$f":"'wedstr. 13'!L22","v":"-"},{"$f":"'wedstr. 13'!M22","v":2},null,"Lattr. Brekl. 9","Soasel 8","O.Ootmarsum 11","Lattr. Brekl. 9"]
[null,null,null,null,null,null,null," "," "," ",null,null,null,null,0,0,0,0]
[null,6,null,null,null,null,null,null,14,null,null,null,null,null,0,0,0,0]
[null,null,null,null,null,null,null,null,null,null,null,null,null,null,0,0,0,0]
[{"$f":"C7","v":"Lattr. Brekl. 9"},"-",{"$f":"C4","v":"Hertme 10"},{"$f":"'wedstr. 6'!K20","v":4},{"$f":"'wedstr. 6'!L20","v":"-"},{"$f":"'wedstr. 6'!M20","v":0},null,{"$f":"C6","v":"Brink 5"},"-",{"$f":"C4","v":"Hertme 10"},{"$f":"'wedstr. 14'!K20","v":4},{"$f":"'wedstr. 14'!L20","v":"-"},{"$f":"'wedstr. 14'!M20","v":0},null,"Lattr. Brekl. 9","Hertme 10","Brink 5","Hertme 10"]
[{"$f":"C8","v":"Soasel 8"},"-",{"$f":"C5","v":"Wilskracht 5"},{"$f":"'wedstr. 6'!K21","v":0},{"$f":"'wedstr. 6'!L21","v":"-"},{"$f":"'wedstr. 6'!M21","v":4},null,{"$f":"C5","v":"Wilskracht 5"},"-",{"$f":"C7","v":"Lattr. Brekl. 9"},{"$f":"'wedstr. 14'!K21","v":2},{"$f":"'wedstr. 14'!L21","v":"-"},{"$f":"'wedstr. 14'!M21","v":2},null,"Soasel 8","Wilskracht 5","Wilskracht 5","Lattr. Brekl. 9"]
[{"$f":"C9","v":"O.Ootmarsum 11"},"-",{"$f":"C6","v":"Brink 5"},{"$f":"'wedstr. 6'!K22","v":0},{"$f":"'wedstr. 6'!L22","v":"-"},{"$f":"'wedstr. 6'!M22","v":4},null,{"$f":"C8","v":"Soasel 8"},"-",{"$f":"C9","v":"O.Ootmarsum 11"},{"$f":"'wedstr. 14'!K22","v":3},{"$f":"'wedstr. 14'!L22","v":"-"},{"$f":"'wedstr. 14'!M22","v":1},null,"O.Ootmarsum 11","Brink 5","Soasel 8","O.Ootmarsum 11"]
[" "," "," ",null,null,null,null," "," "," ",null,null,null,null,0,0,0,0]
[null,7,null,null,null,null,null,null,15,null,null,null,null,null,0,0,0,0]
[null,null,null,null,null,null,null,null,null,null,null,null,null,null,0,0,0,0]
[{"$f":"C4","v":"Hertme 10"},"-",{"$f":"C8","v":"Soasel 8"},{"$f":"'wedstr. 7'!K20","v":2},{"$f":"'wedstr. 7'!L20","v":"-"},{"$f":"'wedstr. 7'!M20","v":2},null,{"$f":"C5","v":"Wilskracht 5"},"-",{"$f":"C6","v":"Brink 5"},{"$f":"'wedstr. 15'!D6","v":3},{"$f":"'wedstr. 15'!E6","v":"-"},{"$f":"'wedstr. 15'!F6","v":1},null,"Hertme 10","Soasel 8","Wilskracht 5","Brink 5"]
[{"$f":"C5","v":"Wilskracht 5"},"-",{"$f":"C9","v":"O.Ootmarsum 11"},{"$f":"'wedstr. 7'!K21","v":4},{"$f":"'wedstr. 7'!L21","v":"-"},{"$f":"'wedstr. 7'!M21","v":0},null,{"$f":"C4","v":"Hertme 10"},"-",{"$f":"C9","v":"O.Ootmarsum 11"},{"$f":"'wedstr. 15'!D7","v":4},{"$f":"'wedstr. 15'!E7","v":"-"},{"$f":"'wedstr. 15'!F7","v":0},null,"Wilskracht 5","O.Ootmarsum 11","Hertme 10","O.Ootmarsum 11"]
[{"$f":"C6","v":"Brink 5"},"-",{"$f":"C7","v":"Lattr. Brekl. 9"},{"$f":"'wedstr. 7'!K22","v":4},{"$f":"'wedstr. 7'!L22","v":"-"},{"$f":"'wedstr. 7'!M22","v":0},null,{"$f":"C7","v":"Lattr. Brekl. 9"},"-",{"$f":"C8","v":"Soasel 8"},{"$f":"'wedstr. 15'!D8","v":3},{"$f":"'wedstr. 15'!E8","v":"-"},{"$f":"'wedstr. 15'!F8","v":1},null,"Brink 5","Lattr. Brekl. 9","Lattr. Brekl. 9","Soasel 8"]
[null,null,null,null,null,null,null," "," "," ",null," ",null,null,0,0,0,0]
[null,8,null,null,null,null,null,null,null,null,null,null,null,null,0,0,0,0]
[null,null,null,null,null,null,null,null,null,null,null,null,null,null,0,0,0,0]
[{"$f":"C5","v":"Wilskracht 5"},"-",{"$f":"C4","v":"Hertme 10"},{"$f":"'wedstr. 8'!K20","v":4},{"$f":"'wedstr. 8'!L20","v":"-"},{"$f":"'wedstr. 8'!M20","v":0},null,null,null,null,null,null,null,null,"Wilskracht 5","Hertme 10",0,0]
[{"$f":"C8","v":"Soasel 8"},"-",{"$f":"C6","v":"Brink 5"},{"$f":"'wedstr. 8'!K21","v":0},{"$f":"'wedstr. 8'!L21","v":"-"},{"$f":"'wedstr. 8'!M21","v":4},null,null,null,null,null,null,null,null,"Soasel 8","Brink 5",0,0]
[{"$f":"C7","v":"Lattr. Brekl. 9"},"-",{"$f":"C9","v":"O.Ootmarsum 11"},{"$f":"'wedstr. 8'!K22","v":4},{"$f":"'wedstr. 8'!L22","v":"-"},{"$f":"'wedstr. 8'!M22","v":0},null,null,null,null,null,null,null,null,"Lattr. Brekl. 9","O.Ootmarsum 11",0,0]

{"sheet":"7e klasse","index":24,"n_rows":59,"n_cols":18,"rows_kept":59,"cut":false,"hidden":false,"merged":[]}
[null,null,"7e Klasse"]
[null,null,"Team","G",null,"P"]
[]
[null,"A","Gunne 6",{"$f":"COUNTIF($O$15:$R$59,C4)","v":15},"-",{"$f":"SUMIF($A$15:$A$59,C4,$D$15:$D$59)+SUMIF($C$15:$C$59,C4,$F$15:$F$59)+SUMIF($H$15:$H$59,C4,$K$15:$K$59)+SUMIF($J$15:$J$59,C4,$M$15:$M$59)","v":14},null,null,null,"Brink 6",{"$f":"COUNTIF($O$15:$R$59,J4)","v":15},"-",{"$f":"SUMIF($A$15:$A$59,J4,$D$15:$D$59)+SUMIF($C$15:$C$59,J4,$F$15:$F$59)+SUMIF($H$15:$H$59,J4,$K$15:$K$59)+SUMIF($J$15:$J$59,J4,$M$15:$M$59)","v":28}]
[null,"B","Hertme 12",15,"-",34,null,null,null,"Gunne 6",15,"-",14]
[null,"C","Lattr. Brekl. 10",15,"-",38,null,null,null,"Hertme 11",15,"-",49]
[null,"D","Brink 6",15,"-",28,null,null,null,"Hertme 12",15,"-",34]
[null,"E","Nijstad 5",15,"-",17,null,null,null,"Lattr. Brekl. 10",15,"-",38]
[null,"F","Hertme 11",15,"-",49,null,null,null,"Nijstad 5",15,"-",17]
[]
[]
[]
[" ",1,null,null,null,null,null,null,9]
[]
[{"$f":"C4","v":"Gunne 6"},"-",{"$f":"C7","v":"Brink 6"},{"$f":"'Wedstr. 1'!D27","v":3},{"$f":"'Wedstr. 1'!E27","v":"-"},{"$f":"'Wedstr. 1'!F27","v":1},null,{"$f":"C4","v":"Gunne 6"},"-",{"$f":"C6","v":"Lattr. Brekl. 10"},{"$f":"'wedstr. 9'!D27","v":0},{"$f":"'wedstr. 9'!E27","v":"-"},{"$f":"'wedstr. 9'!F27","v":4},null,{"$f":"IF($D15+$F15=4,A15,)","v":"Gunne 6"},{"$f":"IF($D15+$F15=4,C15,)","v":"Brink 6"},{"$f":"IF($K15+$M15=4,H15,)","v":"Gunne 6"},{"$f":"IF($K15+$M15=4,J15,)","v":"Lattr. Brekl. 10"}]
[{"$f":"C5","v":"Hertme 12"},"-",{"$f":"C8","v":"Nijstad 5"},{"$f":"'Wedstr. 1'!D28","v":4},{"$f":"'Wedstr. 1'!E28","v":"-"},{"$f":"'Wedstr. 1'!F28","v":0},null,{"$f":"C7","v":"Brink 6"},"-",{"$f":"C5","v":"Hertme 12"},{"$f":"'wedstr. 9'!D28","v":3},{"$f":"'wedstr. 9'!E28","v":"-"},{"$f":"'wedstr. 9'!F28","v":1},null,{"$f":"IF($D16+$F16=4,A16,)","v":"Hertme 12"},{"$f":"IF($D16+$F16=4,C16,)","v":"Nijstad 5"},{"$f":"IF($K16+$M16=4,H16,)","v":"Brink 6"},{"$f":"IF($K16+$M16=4,J16,)","v":"Hertme 12"}]
[{"$f":"C6","v":"Lattr. Brekl. 10"},"-",{"$f":"C9","v":"Hertme 11"},{"$f":"'Wedstr. 1'!D29","v":2},{"$f":"'Wedstr. 1'!E29","v":"-"},{"$f":"'Wedstr. 1'!F29","v":2},null,{"$f":"C9","v":"Hertme 11"},"-",{"$f":"C8","v":"Nijstad 5"},{"$f":"'wedstr. 9'!D29","v":4},{"$f":"'wedstr. 9'!E29","v":"-"},{"$f":"'wedstr. 9'!F29","v":0},null,{"$f":"IF($D17+$F17=4,A17,)","v":"Lattr. Brekl. 10"},{"$f":"IF($D17+$F17=4,C17,)","v":"Hertme 11"},"Hertme 11","Nijstad 5"]
[null,null,null,null,null,null,null," "," "," ",null,null,null,null,{"$f":"IF($D18+$F18=4,A18,)","v":0},{"$f":"IF($D18+$F18=4,C18,)","v":0},0,0]
[null,2,null,null,null,null,null,null,10,null,null,null,null,null,{"$f":"IF($D19+$F19=4,A19,)","v":0},{"$f":"IF($D19+$F19=4,C19,)","v":0},0,0]
[null,null,null,null,null,null,null,null,null,null,null,null,null,null,0,0,0,0]
[{"$f":"C8","v":"Nijstad 5"},"-",{"$f":"C4","v":"Gunne 6"},{"$f":"'wedstr. 2'!D27","v":2},{"$f":"'wedstr. 2'!E27","v":"-"},{"$f":"'wedstr. 2'!F27","v":2},null,{"$f":"C6","v":"Lattr. Brekl. 10"},"-",{"$f":"C5","v":"Hertme 12"},{"$f":"'wedstr. 10'!D27","v":4},{"$f":"'wedstr. 10'!E27","v":"-"},{"$f":"'wedstr. 10'!F27","v":0},null,"Nijstad 5","Gunne 6","Lattr. Brekl. 10","Hertme 12"]
[{"$f":"C9","v":"Hertme 11"},"-",{"$f":"C5","v":"Hertme 12"},{"$f":"'wedstr. 2'!D28","v":0},{"$f":"'wedstr. 2'!E28","v":"-"},{"$f":"'wedstr. 2'!F28","v":4},null,{"$f":"C9","v":"Hertme 11"},"-",{"$f":"C4","v":"Gunne 6"},{"$f":"'wedstr. 10'!D28","v":4},{"$f":"'wedstr. 10'!E28","v":"-"},{"$f":"'wedstr. 10'!F28","v":0},null,"Hertme 11","Hertme 12","Hertme 11","Gunne 6"]
[{"$f":"C7","v":"Brink 6"},"-",{"$f":"C6","v":"Lattr. Brekl. 10"},{"$f":"'wedstr. 2'!D29","v":0},{"$f":"'wedstr. 2'!E29","v":"-"},{"$f":"'wedstr. 2'!F29","v":4},null,{"$f":"C8","v":"Nijstad 5"},"-",{"$f":"C7","v":"Brink 6"},{"$f":"'wedstr. 10'!D29","v":3},{"$f":"'wedstr. 10'!E29","v":"-"},{"$f":"'wedstr. 10'!F29","v":1},null,"Brink 6","Lattr. Brekl. 10","Nijstad 5","Brink 6"]
[" "," "," ",null,null,null,null," "," "," ",null,null,null,null,0,0,0,0]
[null,3,null,null,null,null,null,null,11,null,null,null,null,null,0,0,0,0]
[null,null,null,null,null,null,null,null,null,null,null,null,null,null,0,0,0,0]
[{"$f":"C4","v":"Gunne 6"},"-",{"$f":"C5","v":"Hertme 12"},{"$f":"'wedstr. 3'!D27","v":1},{"$f":"'wedstr. 3'!E27","v":"-"},{"$f":"'wedstr. 3'!F27","v":3},null,{"$f":"C4","v":"Gunne 6"},"-",{"$f":"C7","v":"Brink 6"},{"$f":"'wedstr. 11'!D27","v":1},{"$f":"'wedstr. 11'!E27","v":"-"},{"$f":"'wedstr. 11'!F27","v":3},null,"Gunne 6","Hertme 12","Gunne 6","Brink 6"]
[{"$f":"C6","v":"Lattr. Brekl. 10"},"-",{"$f":"C8","v":"Nijstad 5"},{"$f":"'wedstr. 3'!D28","v":3},{"$f":"'wedstr. 3'!E28","v":"-"},{"$f":"'wedstr. 3'!F28","v":1},null,{"$f":"C5","v":"Hertme 12"},"-",{"$f":"C8","v":"Nijstad 5"},{"$f":"'wedstr. 11'!D28","v":1},{"$f":"'wedstr. 11'!E28","v":"-"},{"$f":"'wedstr. 11'!F28","v":3},null,"Lattr. Brekl. 10","Nijstad 5","Hertme 12","Nijstad 5"]
[{"$f":"C9","v":"Hertme 11"},"-",{"$f":"C7","v":"Brink 6"},{"$f":"'wedstr. 3'!D29","v":2},{"$f":"'wedstr. 3'!E29","v":"-"},{"$f":"'wedstr. 3'!F29","v":2},null,{"$f":"C6","v":"Lattr. Brekl. 10"},"-",{"$f":"C9","v":"Hertme 11"},{"$f":"'wedstr. 11'!D29","v":0},{"$f":"'wedstr. 11'!E29","v":"-"},{"$f":"'wedstr. 11'!F29","v":4},null,"Hertme 11","Brink 6","Lattr. Brekl. 10","Hertme 11"]
[null,null,null,null,null,null,null,null,null,null,null,null,null,null,0,0,0,0]
[null,4,null,null,null,null,null,null,12,null,null,null,null,null,0,0,0,0]
[null,null,null,null,null,null,null,null,null,null,null,null,null,null,0,0,0,0]
[{"$f":"C6","v":"Lattr. Brekl. 10"},"-",{"$f":"C4","v":"Gunne 6"},{"$f":"'wedstr. 4'!D27","v":4},{"$f":"'wedstr. 4'!E27","v":"-"},{"$f":"'wedstr. 4'!F27","v":0},null,{"$f":"C8","v":"Nijstad 5"},"-",{"$f":"C4","v":"Gunne 6"},{"$f":"'wedstr. 12'!D27","v":0},{"$f":"'wedstr. 12'!E27","v":"-"},{"$f":"'wedstr. 12'!F27","v":4},null,"Lattr. Brekl. 10","Gunne 6","Nijstad 5","Gunne 6"]
[{"$f":"C5","v":"Hertme 12"},"-",{"$f":"C7","v":"Brink 6"},{"$f":"'wedstr. 4'!D28","v":3},{"$f":"'wedstr. 4'!E28","v":"-"},{"$f":"'wedstr. 4'!F28","v":1},null,{"$f":"C9","v":"Hertme 11"},"-",{"$f":"C5","v":"Hertme 12"},{"$f":"'wedstr. 12'!D28","v":2},{"$f":"'wedstr. 12'!E28","v":"-"},{"$f":"'wedstr. 12'!F28","v":2},null,"Hertme 12","Brink 6","Hertme 11","Hertme 12"]
[{"$f":"C8","v":"Nijstad 5"},"-",{"$f":"C9","v":"Hertme 11"},{"$f":"'wedstr. 4'!D29","v":0},{"$f":"'wedstr. 4'!E29","v":"-"},{"$f":"'wedstr. 4'!F29","v":4},null,{"$f":"C7","v":"Brink 6"},"-",{"$f":"C6","v":"Lattr. Brekl. 10"},{"$f":"'wedstr. 12'!D29","v":1},{"$f":"'wedstr. 12'!E29","v":"-"},{"$f":"'wedstr. 12'!F29","v":3},null,"Nijstad 5","Hertme 11","Brink 6","Lattr. Brekl. 10"]
[null,null,null,null,null,null,null," "," "," ",null,null,null,null,0,0,0,0]
[null,5,null,null,null,null,null,null,13,null,null,null,null,null,0,0,0,0]
[null,null,null,null,null,null,null,null,null,null,null,null,null,null,0,0,0,0]
[{"$f":"C5","v":"Hertme 12"},"-",{"$f":"C6","v":"Lattr. Brekl. 10"},{"$f":"'wedstr. 5'!D27","v":3},{"$f":"'wedstr. 5'!E27","v":"-"},{"$f":"'wedstr. 5'!F27","v":1},null,{"$f":"C4","v":"Gunne 6"},"-",{"$f":"C5","v":"Hertme 12"},{"$f":"'wedstr. 13'!D27","v":0},{"$f":"'wedstr. 13'!E27","v":"-"},{"$f":"'wedstr. 13'!F27","v":4},null,"Hertme 12","Lattr. Brekl. 10","Gunne 6","Hertme 12"]
[{"$f":"C4","v":"Gunne 6"},"-",{"$f":"C9","v":"Hertme 11"},{"$f":"'wedstr. 5'!D28","v":0},{"$f":"'wedstr. 5'!E28","v":"-"},{"$f":"'wedstr. 5'!F28","v":4},null,{"$f":"C6","v":"Lattr. Brekl. 10"},"-",{"$f":"C8","v":"Nijstad 5"},{"$f":"'wedstr. 13'!D28","v":3},{"$f":"'wedstr. 13'!E28","v":"-"},{"$f":"'wedstr. 13'!F28","v":1},null,"Gunne 6","Hertme 11","Lattr. Brekl. 10","Nijstad 5"]
[{"$f":"C7","v":"Brink 6"},"-",{"$f":"C8","v":"Nijstad 5"},{"$f":"'wedstr. 5'!D29","v":4},{"$f":"'wedstr. 5'!E29","v":"-"},{"$f":"'wedstr. 5'!F29","v":0},null,{"$f":"C9","v":"Hertme 11"},"-",{"$f":"C7","v":"Brink 6"},{"$f":"'wedstr. 13'!D29","v":3},{"$f":"'wedstr. 13'!E29","v":"-"},{"$f":"'wedstr. 13'!F29","v":1},null,"Brink 6","Nijstad 5","Hertme 11","Brink 6"]
[null,null,null,null,null,null,null," "," "," ",null,null,null,null,0,0,0,0]
[null,6,null,null,null,null,null,null,14,null,null,null,null,null,0,0,0,0]
[null,null,null,null,null,null,null,null,null,null,null,null,null,null,0,0,0,0]
[{"$f":"C7","v":"Brink 6"},"-",{"$f":"C4","v":"Gunne 6"},{"$f":"'wedstr. 6'!D27","v":4},{"$f":"'wedstr. 6'!E27","v":"-"},{"$f":"'wedstr. 6'!F27","v":0},null,{"$f":"C6","v":"Lattr. Brekl. 10"},"-",{"$f":"C4","v":"Gunne 6"},{"$f":"'wedstr. 14'!D27","v":4},{"$f":"'wedstr. 14'!E27","v":"-"},{"$f":"'wedstr. 14'!F27","v":0},null,"Brink 6","Gunne 6","Lattr. Brekl. 10","Gunne 6"]
[{"$f":"C8","v":"Nijstad 5"},"-",{"$f":"C5","v":"Hertme 12"},{"$f":"'wedstr. 6'!D28","v":1},{"$f":"'wedstr. 6'!E28","v":"-"},{"$f":"'wedstr. 6'!F28","v":3},null,{"$f":"C5","v":"Hertme 12"},"-",{"$f":"C7","v":"Brink 6"},{"$f":"'wedstr. 14'!D28","v":0},{"$f":"'wedstr. 14'!E28","v":"-"},{"$f":"'wedstr. 14'!F28","v":4},null,"Nijstad 5","Hertme 12","Hertme 12","Brink 6"]
[{"$f":"C9","v":"Hertme 11"},"-",{"$f":"C6","v":"Lattr. Brekl. 10"},{"$f":"'wedstr. 6'!D29","v":4},{"$f":"'wedstr. 6'!E29","v":"-"},{"$f":"'wedstr. 6'!F29","v":0},null,{"$f":"C8","v":"Nijstad 5"},"-",{"$f":"C9","v":"Hertme 11"},{"$f":"'wedstr. 14'!D29","v":0},{"$f":"'wedstr. 14'!E29","v":"-"},{"$f":"'wedstr. 14'!F29","v":4},null,"Hertme 11","Lattr. Brekl. 10","Nijstad 5","Hertme 11"]
[" "," "," ",null,null,null,null," "," "," ",null,null,null,null,0,0,0,0]
[null,7,null,null,null,null,null,null,15,null,null,null,null,null,0,0,0,0]
[null,null,null,null,null,null,null,null,null,null,null,null,null,null,0,0,0,0]
[{"$f":"C4","v":"Gunne 6"},"-",{"$f":"C8","v":"Nijstad 5"},{"$f":"'wedstr. 7'!D27","v":1},{"$f":"'wedstr. 7'!E27","v":"-"},{"$f":"'wedstr. 7'!F27","v":3},null,{"$f":"C5","v":"Hertme 12"},"-",{"$f":"C6","v":"Lattr. Brekl. 10"},{"$f":"'wedstr. 15'!K6","v":4},{"$f":"'wedstr. 15'!L6","v":"-"},{"$f":"'wedstr. 15'!M6","v":0},null,"Gunne 6","Nijstad 5","Hertme 12","Lattr. Brekl. 10"]
[{"$f":"C5","v":"Hertme 12"},"-",{"$f":"C9","v":"Hertme 11"},{"$f":"'wedstr. 7'!D28","v":0},{"$f":"'wedstr. 7'!E28","v":"-"},{"$f":"'wedstr. 7'!F28","v":4},null,{"$f":"C4","v":"Gunne 6"},"-",{"$f":"C9","v":"Hertme 11"},{"$f":"'wedstr. 15'!K7","v":0},{"$f":"'wedstr. 15'!L7","v":"-"},{"$f":"'wedstr. 15'!M7","v":4},null,"Hertme 12","Hertme 11","Gunne 6","Hertme 11"]
[{"$f":"C6","v":"Lattr. Brekl. 10"},"-",{"$f":"C7","v":"Brink 6"},{"$f":"'wedstr. 7'!D29","v":4},{"$f":"'wedstr. 7'!E29","v":"-"},{"$f":"'wedstr. 7'!F29","v":0},null,{"$f":"C7","v":"Brink 6"},"-",{"$f":"C8","v":"Nijstad 5"},{"$f":"'wedstr. 15'!K8","v":3},{"$f":"'wedstr. 15'!L8","v":"-"},{"$f":"'wedstr. 15'!M8","v":1},null,"Lattr. Brekl. 10","Brink 6","Brink 6","Nijstad 5"]
[null,null,null,null,null,null,null," "," "," ",null," ",null,null,0,0,0,0]
[null,8,null,null,null,null,null,null,null,null,null,null,null,null,0,0,0,0]
[null,null,null,null,null,null,null,null,null,null,null,null,null,null,0,0,0,0]
[{"$f":"C5","v":"Hertme 12"},"-",{"$f":"C4","v":"Gunne 6"},{"$f":"'wedstr. 8'!D27","v":2},{"$f":"'wedstr. 8'!E27","v":"-"},{"$f":"'wedstr. 8'!F27","v":2},null,null,null,null,null,null,null,null,"Hertme 12","Gunne 6",0,0]
[{"$f":"C8","v":"Nijstad 5"},"-",{"$f":"C6","v":"Lattr. Brekl. 10"},{"$f":"'wedstr. 8'!D28","v":2},{"$f":"'wedstr. 8'!E28","v":"-"},{"$f":"'wedstr. 8'!F28","v":2},null,null,null,null,null,null,null,null,"Nijstad 5","Lattr. Brekl. 10",0,0]
[{"$f":"C7","v":"Brink 6"},"-",{"$f":"C9","v":"Hertme 11"},{"$f":"'wedstr. 8'!D29","v":0},{"$f":"'wedstr. 8'!E29","v":"-"},{"$f":"'wedstr. 8'!F29","v":4},null,null,null,null,null,null,null,null,"Brink 6","Hertme 11",0,0]